program: Gaussian 09
title: 000252024
version: EM64L-G09RevD.01
frameworkgroup: C1[X(C12H14ClNO4)]
method: RPBEPBE
basis: SDD
operation: Freq
keyword: #p
keyword: freq=noraman
keyword: PBEPBE/SDD
title: #p freq=noraman PBEPBE/SDD
converged: YES YES NO NO
title: Mulliken charges:
elementType: Cl O O O O N C C C C C C C C C C C C H H H H H H H H H H H H H H
charge: -0.051652 -0.310507 -0.252502 -0.223341 -0.267095 -0.457425 -0.080154 -0.702331 0.274144 0.485314 -0.251308 0.273582 -0.443069 -0.354851 -0.574003 -0.195185 -0.210764 -0.256266 0.269495 0.247471 0.238025 0.232327 0.256892 0.243990 0.332904 0.223491 0.297791 0.301160 0.270530 0.227090 0.226826 0.229423
chargesum: 0.00000
title: Mulliken charges with hydrogens summed into heavy atoms:
elementType: Cl O O O O N C C C C C C C C C C C C
charge: -0.051652 -0.310507 -0.252502 -0.223341 -0.267095 -0.124521 0.189341 0.015491 0.274144 0.485314 0.249573 0.273582 -0.219578 -0.057059 -0.002313 0.031904 0.016062 -0.026844
polarizability: 2.33351085e+02 2.20430980e+01 1.33681554e+02 -2.09884126e+01 1.63632556e+01 1.16666489e+02
1716.lowfreq: -11.1483 -4.4236 -0.0019 -0.0006 0.0014 2.9405 14.3762 20.6233 30.3037
frequency: 14.3380 20.5805 30.2067 39.0965 57.2409 83.8742 86.2321 94.0243 129.7730 176.6811 203.3725 215.0134 227.8514 247.2234 253.5134 306.4601 339.0751 343.7399 364.4561 408.1096 438.5656 490.1693 509.1667 599.8057 606.7669 615.9369 631.2914 641.8259 688.7570 696.4077 704.0909 713.5055 767.0501 785.9795 808.5129 841.4749 847.6490 886.6203 914.2556 932.2479 972.0805 977.7798 986.0082 996.3375 1002.1755 1027.8189 1041.7161 1053.4348 1083.6540 1091.4096 1112.2212 1146.1892 1165.9469 1173.0704 1180.3543 1190.8020 1240.7816 1259.1626 1279.1588 1304.1589 1324.7193 1329.8622 1367.1565 1386.6287 1391.6965 1434.2907 1435.0699 1446.1690 1465.9783 1477.3613 1486.5634 1520.0919 1602.0863 1617.7007 1657.2354 1676.5150 3006.3931 3014.2425 3039.2268 3064.1738 3110.5955 3115.2155 3117.8924 3119.4469 3133.0079 3145.5061 3152.6591 3165.8703 3189.6898 3542.8951
redmass: 7.8264 6.6734 4.7901 10.1600 6.7597 4.9617 7.2836 5.0029 3.9409 5.0204 4.2070 1.1897 4.0188 4.0469 4.4119 4.4071 4.2371 4.5847 4.7959 2.9156 3.7036 3.9056 2.8249 5.3832 5.2492 6.0890 2.8065 1.7833 4.8044 2.0615 5.3049 5.6104 1.6754 3.5010 3.8793 1.2651 3.0441 3.4220 1.4337 2.1989 1.3572 4.2182 5.6970 1.3073 1.9335 2.1105 2.1253 2.3660 2.9895 1.6289 3.1244 2.3764 3.1318 1.0548 1.3044 1.1132 1.1673 2.0693 1.4583 1.1644 1.3934 1.3502 1.2818 7.5163 1.2091 1.1550 2.1139 1.0937 1.0464 1.0545 2.2341 2.2201 5.1566 6.0466 10.3553 9.4211 1.0349 1.0634 1.0843 1.0588 1.1010 1.0883 1.1007 1.1016 1.0870 1.0935 1.1084 1.0996 1.0953 1.0760
irintensity: 0.4006 0.3622 1.5175 1.8435 4.5933 2.2808 2.7863 1.6265 3.9113 4.5594 6.4295 0.5781 2.5502 3.5377 1.3898 1.0006 17.4484 15.9034 10.7111 0.0161 5.8735 15.9125 27.4585 7.6085 8.8651 4.8612 34.6305 5.6046 18.3288 40.7262 41.0217 9.5111 107.5384 8.8145 0.5406 0.4387 6.6871 13.5956 13.7933 26.5816 0.1484 148.5671 17.3094 2.2917 20.2967 6.0587 59.9339 83.3335 553.6654 45.3601 58.5048 201.1739 139.1157 0.9083 9.4031 5.5803 2.7265 6.0080 1.8799 23.8734 25.3021 22.4377 2.4137 43.9323 15.3133 26.5838 93.4361 20.6360 17.1236 13.9413 19.1033 494.4167 27.3448 103.3257 211.0063 219.9992 12.6661 16.9314 5.2460 13.8198 17.7849 13.2658 13.6788 3.4621 0.7854 30.4982 8.8981 23.4201 5.6938 32.9629
temp: 298.150 k
press: 1.00000 atm
elementType: 17 8 8 8 8 7 6 6 6 6 6 6 6 6 6 6 6 6 1 1 1 1 1 1 1 1 1 1 1 1 1 1
symmnumber: 1
zpe: 643478.1 jmol-1
zpe.correction: 0.245088 hartree
zpe.thermalcorrener: 0.263282 hartree
zpe.thermalcorrenthalpy: 0.264226 hartree
zpe.thermalcorrgfe: 0.194586 hartree
zpe.sumelectzpe: -1280.059756 hartree
zpe.sumelectthermal: -1280.041562 hartree
zpe.sumelectthermalent: -1280.040618 hartree
zpe.sumelectthermalfe: -1280.110259 hartree
dipole: -0.2459 0.2928 1.0011
dipole: 1.0717
quadrupole: -106.5050 -101.9753 -112.7354
quadrupole: -9.3869 -4.2138 2.7626
quadrupole: 0.5669 5.0966 -5.6635 -9.3869 -4.2138 2.7626
hfenergy: -1280.3048442 hartree
pointgroup: C01 [X(C12H14Cl1N1O4)]
dipole: -0.110161 -0.2720588 -0.3026829 debye
polarizability: 234.054211|-12.7981393|143.8158339|25.5969115|3.2203123|105.8290825 unknown
InChI: InChI=1S/C12H14ClNO4/c1-9(11(15)17-8-7-13)18-12(16)14-10-5-3-2-4-6-10/h2-6,9,14H,7-8H2,1H3
charge 0 multiplicity 1
32 atoms
Cl 6.476215 -0.439371 -0.543606
O  0.482359 -1.301669 0.686924
O  3.57833 0.633345 0.402063
O  2.009688 0.075686 -1.238042
O  -0.363316 0.872762 1.048374
N  -1.668289 -0.890601 0.135946
C  1.81298 -0.815891 1.08602
C  2.660804 -2.051922 1.417797
C  2.425939 -0.003379 -0.065024
C  -2.947501 -0.295145 -0.050056
C  4.348535 1.41452 -0.598159
C  -0.530336 -0.30522 0.649651
C  -3.966242 -1.105478 -0.618632
C  -3.230077 1.049432 0.307274
C  5.179178 0.525775 -1.514686
C  -5.256096 -0.577661 -0.828444
C  -4.527626 1.561301 0.09056
C  -5.546577 0.76075 -0.474717
H  1.715967 -0.145476 1.959066
H  3.67814 -1.739877 1.705785
H  2.200007 -2.60175 2.254848
H  2.726124 -2.72566 0.546684
H  4.977891 2.082665 0.008127
H  3.642408 2.002054 -1.216124
H  -1.554731 -1.863545 -0.157185
H  -3.748259 -2.144551 -0.896949
H  -2.443674 1.671007 0.740211
H  4.567287 -0.221135 -2.038243
H  5.74202 1.139034 -2.235401
H  -6.032772 -1.212623 -1.26875
H  -4.740272 2.59995 0.367672
H  -6.548606 1.170974 -0.638084
