program: Gaussian 09
title: 000252010
version: EM64L-G09RevD.01
frameworkgroup: C1[X(C14H12O)]
method: RPBEPBE
basis: SDD
operation: Freq
keyword: #pfreq=noraman
keyword: PBEPBE/SDD
title: #p freq=noraman PBEPBE/SDD
converged: NO YES NO YES
title: Mulliken charges:
elementType: O C C C C C C C C C C C C C C H H H H H H H H H H H H
charge: -0.265900 -0.690658 0.273481 0.214168 0.285589 0.159438 -0.540514 -0.403513 -0.424322 -0.386905 0.325198 -0.368190 -0.236342 -0.239487 -0.536493 0.242257 0.242256 0.250374 0.241607 0.240611 0.234153 0.249166 0.224525 0.224535 0.244396 0.220284 0.220285
chargesum: 0.00000
title: Mulliken charges with hydrogens summed into heavy atoms:
elementType: O C C C C C C C C C C C C C C
charge: -0.265900 -0.206145 0.273481 0.214168 0.285589 0.159438 -0.290140 -0.161907 -0.183710 -0.152752 0.325198 -0.119024 -0.011817 -0.014952 0.148472
polarizability: 2.36647596e+02 7.26591496e+00 1.68988093e+02 1.92562578e-03 -1.00128083e-02 6.82500155e+01
1716.lowfreq: -6.0205 -5.2107 0.0003 0.0008 0.0009 3.6643 72.5971 91.5473 136.9432
frequency: 72.5938 91.5445 136.9423 137.7237 190.6646 239.0737 251.2797 271.4571 327.0264 369.4214 419.2583 439.8909 442.9455 487.2164 499.8472 528.7691 599.0378 617.4884 626.4955 700.1927 704.6253 735.5456 775.7970 783.8297 803.8121 820.9356 862.3535 869.1218 869.6366 924.5636 950.6918 970.9015 984.3231 990.2730 1008.6355 1026.0998 1094.5816 1113.0476 1116.1988 1130.9861 1154.3183 1167.9917 1176.7579 1186.9303 1195.5695 1212.9691 1249.1532 1289.2442 1307.9799 1381.1742 1396.4433 1418.5527 1430.3831 1438.2342 1450.1345 1465.5382 1471.4939 1481.7103 1485.9318 1589.7198 1591.1865 1620.1356 1623.6414 2954.9500 2978.6765 3021.4872 3041.3470 3119.1516 3122.7086 3125.8765 3130.0843 3139.9011 3152.4042 3159.5604 3167.1350
redmass: 3.2836 4.2872 4.0061 4.0773 2.1039 1.3540 3.6424 3.0293 3.1545 6.8728 2.8918 2.7796 4.2992 6.0115 3.2080 3.7212 6.1246 3.7514 6.9744 2.6497 5.9360 1.6306 1.9384 4.7527 4.3787 1.3961 1.6827 1.3881 5.9223 1.6556 1.3941 1.6999 1.3350 7.5433 3.0787 2.0892 2.0821 1.2607 1.4471 1.1431 1.3561 1.1465 1.7868 1.7075 2.2168 2.8853 1.9172 1.6425 1.9437 7.0047 4.3431 2.1585 1.1602 1.6073 2.2307 1.0500 1.1508 2.9047 2.9288 7.3914 6.9716 7.5000 6.9882 1.0331 1.0608 1.0993 1.1038 1.0853 1.0990 1.0895 1.0897 1.0945 1.0909 1.1002 1.0951
irintensity: 4.2500 0.3218 5.0010 1.0508 0.1199 2.9123 4.4228 1.4299 7.8863 1.2394 6.6011 0.1159 0.6053 4.1788 2.7055 1.0308 5.0557 7.7178 6.7708 6.2027 6.4958 34.0477 60.3827 4.5928 4.1985 28.3521 28.7716 0.2053 9.1373 3.2782 2.9203 6.6393 0.2870 40.7042 3.4751 5.8722 3.9696 0.2237 3.8420 0.0086 1.0955 0.1090 73.4751 36.6617 39.9958 38.9572 6.7297 20.3110 16.8499 15.0471 6.4718 16.9500 13.7834 26.3549 28.2084 13.0712 64.9378 69.1095 5.3368 13.8112 0.9890 37.7626 55.3475 59.0673 20.0353 9.4556 51.1680 5.2397 29.8050 2.9349 16.0939 32.0113 9.1051 38.6195 8.3955
temp: 298.150 k
press: 1.00000 atm
elementType: 8 6 6 6 6 6 6 6 6 6 6 6 6 6 6 1 1 1 1 1 1 1 1 1 1 1 1
symmnumber: 1
zpe: 567528.2 jmol-1
zpe.correction: 0.216160 hartree
zpe.thermalcorrener: 0.227983 hartree
zpe.thermalcorrenthalpy: 0.228927 hartree
zpe.thermalcorrgfe: 0.178403 hartree
zpe.sumelectzpe: -614.876497 hartree
zpe.sumelectthermal: -614.864674 hartree
zpe.sumelectthermalent: -614.863730 hartree
zpe.sumelectthermalfe: -614.914255 hartree
dipole: -0.4793 -0.9521 0.0002
dipole: 1.0660
quadrupole: -81.9208 -71.7792 -93.1080
quadrupole: -7.5049 0.0015 -0.0024
quadrupole: 0.3486 10.4902 -10.8387 -7.5049 0.0015 -0.0024
hfenergy: -615.0926575 hartree
pointgroup: C01 [X(C14H12O1)]
dipole: 0.2082755 -0.3640216 -0.0000928 debye
polarizability: 237.2287772|-3.6239875|168.4069109|0.0013893|0.0101012|68.2500155 unknown
InChI: InChI=1S/C14H12O/c1-15-12-7-6-11-8-10-4-2-3-5-13(10)14(11)9-12/h2-7,9H,8H2,1H3
charge 0 multiplicity 1
27 atoms
O  -3.883015 -0.775362 0.000079
C  1.120643 2.026297 0.000371
C  -0.283043 1.432827 0.000315
C  -0.214932 0.009478 0.000172
C  2.011149 0.787985 0.000267
C  1.205145 -0.392772 0.000143
C  -1.385803 -0.782938 0.000087
C  -1.536612 2.074447 0.00038
C  3.41327 0.693541 0.000278
C  1.806656 -1.670782 0.000027
C  -2.638619 -0.120929 0.000148
C  -2.71472 1.298275 0.000297
C  4.016717 -0.590227 0.000162
C  3.218333 -1.761085 0.000037
C  -3.87726 -2.238763 -0.000162
H  1.30406 2.663368 0.888408
H  1.304056 2.663487 -0.887584
H  -1.317491 -1.875002 -0.000017
H  -1.610227 3.167952 0.000494
H  4.037782 1.594716 0.000376
H  1.196843 -2.581695 -0.000069
H  -3.705499 1.762761 0.000342
H  5.109067 -0.678169 0.000171
H  3.700533 -2.745241 -0.000052
H  -4.937995 -2.529987 -0.000245
H  -3.380152 -2.640743 0.904714
H  -3.380089 -2.640443 -0.905136
