program: Gaussian 09
title: 000252022
version: EM64L-G09RevD.01
frameworkgroup: C1[X(C14H16O4)]
method: RPBEPBE
basis: SDD
operation: Freq
keyword: #pfreq=noraman
keyword: PBEPBE/SDD
title: #p freq=noraman PBEPBE/SDD
converged: YES YES NO NO
title: Mulliken charges:
elementType: O O O O C C C C C C C C C C C C C C H H H H H H H H H H H H H H H H
charge: -0.210519 -0.272394 -0.215457 -0.260158 0.104248 -0.482667 -0.587466 0.037286 0.429769 0.138462 -0.736601 0.206715 -0.549977 -0.359399 0.333536 -0.378602 -0.504303 -0.535815 0.237281 0.223922 0.242685 0.230977 0.218070 0.251456 0.234388 0.259703 0.278301 0.247001 0.246125 0.232582 0.240139 0.247832 0.225561 0.227321
chargesum: 0.00000
title: Mulliken charges with hydrogens summed into heavy atoms:
elementType: O O O O C C C C C C C C C C C C C C
charge: -0.210519 -0.272394 -0.215457 -0.260158 0.104248 -0.021465 -0.113804 0.037286 0.429769 0.138462 -0.032688 0.206715 -0.290274 -0.081098 0.333536 -0.131601 0.214543 0.164899
polarizability: 2.37130401e+02 -1.13643431e+01 1.49154008e+02 -1.29712543e+01 -1.27791155e+01 1.16822486e+02
1716.lowfreq: -16.6459 -6.0327 0.0006 0.0007 0.0009 9.4848 11.6918 31.4513 72.8442
frequency: -14.8091 31.3221 72.8249 80.6897 83.4771 117.0285 120.9955 160.5123 175.0656 192.9222 217.0760 223.9109 242.3098 264.4106 273.5155 300.6858 317.7475 326.6753 327.9476 366.1279 435.2133 459.8369 476.5588 508.7993 530.1506 564.9532 581.9679 628.6070 670.6217 704.6435 711.1614 726.3062 758.5287 778.2153 829.5767 866.7525 877.9088 894.9073 914.4334 936.1629 959.7727 981.2663 995.8358 1011.2104 1042.8522 1085.0868 1091.5019 1112.0435 1113.1318 1136.0824 1137.9929 1145.4817 1147.5802 1163.9272 1179.4232 1219.0312 1236.9212 1241.1508 1265.7117 1295.5309 1326.3625 1350.9690 1384.9576 1386.1956 1420.5270 1435.6879 1444.3013 1450.3757 1458.1558 1460.8358 1463.5226 1469.1306 1471.8571 1473.4874 1475.9350 1488.3451 1562.9779 1579.0549 1621.6905 1629.7274 2964.5916 2967.9800 2996.2716 2999.7478 3004.6594 3038.6681 3059.6572 3067.4706 3096.9549 3106.5842 3118.2692 3130.3430 3147.3201 3148.5924 3148.8570 3170.1125
redmass: 4.0891 4.1783 1.5262 3.1681 2.9397 4.3189 4.0715 4.0842 3.8659 1.0666 2.7953 1.3876 2.9243 2.8545 2.9573 4.0010 4.4906 4.3368 2.9802 5.6883 3.0835 4.0718 5.4608 5.2770 4.5966 3.5945 4.9902 3.5156 3.6936 4.6296 5.4473 5.2529 4.5917 3.1843 1.5437 2.3887 2.7545 1.7454 2.4486 5.2631 2.8576 1.3774 3.9181 1.7165 1.8410 3.4938 3.4910 1.2655 1.2584 1.7699 1.6111 1.4520 1.5334 2.3957 1.6997 1.7760 2.0478 2.4178 2.2588 1.8922 1.4640 1.5164 1.2031 8.4065 1.1741 1.3514 2.8390 1.0506 1.1268 1.0763 1.0514 1.0497 1.0755 1.0988 1.0585 2.5190 9.0536 8.0156 8.9918 8.2474 1.0664 1.0325 1.0603 1.0378 1.0294 1.0937 1.1043 1.1011 1.0985 1.1045 1.1014 1.1001 1.0906 1.1050 1.0892 1.0957
irintensity: 0.8414 1.7535 1.1214 0.2558 1.9219 8.2728 1.2660 0.9083 7.2921 0.1365 3.1009 0.9554 6.4833 0.6334 2.1580 1.8843 15.0611 1.0258 2.6043 8.1310 1.3797 2.9552 15.0235 8.8821 1.0909 9.0924 25.1401 0.5333 8.3850 4.5980 1.5677 1.1439 8.0590 12.5682 32.6326 6.4573 4.0805 15.1430 61.1046 10.3237 24.7917 4.2143 37.1629 15.8136 16.1949 227.7818 86.1950 0.0084 0.2811 94.9364 36.7836 16.6366 36.0028 2.0055 26.2743 46.7205 6.7827 82.6212 218.1553 96.3340 2.2230 17.7562 32.4168 10.9986 14.3253 6.5558 2.2056 12.0685 14.1430 2.6812 9.3762 14.9563 26.8503 52.2511 20.3543 19.8573 41.3721 332.0887 67.7110 241.5093 16.6218 70.1405 12.8217 34.9897 35.5240 30.5956 42.0040 24.5277 25.7945 24.3177 10.0720 22.9697 3.5682 15.8682 1.5802 14.7598
temp: 298.150 k
press: 1.00000 atm
elementType: 8 8 8 8 6 6 6 6 6 6 6 6 6 6 6 6 6 6 1 1 1 1 1 1 1 1 1 1 1 1 1 1 1 1
symmnumber: 1
zpe: 710774.8 jmol-1
zpe.correction: 0.270720 hartree
zpe.thermalcorrener: 0.287613 hartree
zpe.thermalcorrenthalpy: 0.288558 hartree
zpe.thermalcorrgfe: 0.226384 hartree
zpe.sumelectzpe: -842.647690 hartree
zpe.sumelectthermal: -842.630797 hartree
zpe.sumelectthermalent: -842.629853 hartree
zpe.sumelectthermalfe: -842.692026 hartree
dipole: 1.5109 -2.8096 1.4202
dipole: 3.4920
quadrupole: -74.7704 -109.0189 -107.1164
quadrupole: 11.9639 -5.3418 1.5735
quadrupole: 22.1982 -12.0504 -10.1479 11.9639 -5.3418 1.5735
hfenergy: -842.9184102 hartree
pointgroup: C01[X(C14H16O4)]
dipole: 0.6090558 1.1701991 -0.3836217 debye
polarizability: 236.6853235|8.9776734|151.9971474|16.641687|-7.6006822|114.4244248 unknown
InChI: InChI=1S/C14H16O4/c1-14(13(16)18-3)7-6-9-8-10(17-2)4-5-11(9)12(14)15/h4-5,8H,6-7H2,1-3H3
charge 0 multiplicity 1
34 atoms
O  -0.950254 -2.574812 0.047931
O  -3.689294 0.961907 0.252219
O  -2.094328 0.155899 1.737074
O  4.396289 1.051386 0.144089
C  -1.972295 -0.468677 -0.682513
C  -1.470853 0.627407 -1.672182
C  -0.350612 1.490833 -1.057859
C  -0.772467 -1.350794 -0.221283
C  0.796932 0.641999 -0.532341
C  0.567632 -0.712515 -0.132206
C  -3.060626 -1.349689 -1.347585
C  -2.549391 0.215393 0.573337
C  2.092523 1.179308 -0.425373
C  1.649693 -1.48083 0.371921
C  3.160974 0.400808 0.084545
C  2.941249 -0.944076 0.489655
C  -4.340207 1.654303 1.3917
C  5.543546 0.301481 0.669218
H  -2.327334 1.258134 -1.969356
H  -1.095149 0.117642 -2.580939
H  -0.767195 2.090929 -0.221815
H  0.024508 2.217383 -1.80197
H  -2.652037 -1.817716 -2.260966
H  -3.37308 -2.161067 -0.670709
H  -3.935982 -0.736288 -1.616351
H  2.302573 2.209171 -0.732875
H  1.442546 -2.512836 0.673817
H  3.754113 -1.558099 0.887237
H  -4.667639 0.919008 2.145524
H  -5.198157 2.178302 0.947807
H  -3.637828 2.36315 1.861776
H  6.387757 1.004386 0.623418
H  5.761098 -0.586566 0.04557
H  5.371596 -0.009963 1.717087
