program: Gaussian 09
title: 000252003
version: EM64L-G09RevD.01
frameworkgroup: C1[X(C14H12ClN3O)]
method: RPBEPBE
basis: SDD
operation: Freq
keyword: #p
keyword: freq=noraman
keyword: PBEPBE/SDD
title: #p freq=noraman PBEPBE/SDD
converged: YES YES NO NO
title: Mulliken charges:
elementType: Cl O N N N C C C C C C C C C C C C C C H H H H H H H H H H H H
charge: 0.067656 -0.227027 -0.483508 -0.110991 -0.118518 0.556763 0.169254 -0.305508 -0.365945 -0.344165 -0.277801 0.178397 0.242985 -0.338515 -0.293871 -0.203024 -0.199887 -0.234073 -0.769203 0.274952 0.259654 0.255874 0.279006 0.251785 0.276190 0.232694 0.230370 0.232228 0.256430 0.255938 0.251859
chargesum: 0.00000
title: Mulliken charges with hydrogens summed into heavy atoms:
elementType: Cl O N N N C C C C C C C C C C C C C C
charge: 0.067656 -0.227027 -0.483508 -0.110991 -0.118518 0.556763 0.169254 -0.030556 -0.106291 -0.088291 0.001205 0.178397 0.242985 -0.086730 -0.017681 0.029671 0.030483 -0.001845 -0.004975
polarizability: 5.09970394e+02 -4.31122527e+00 1.83169777e+02 -2.61334352e+00 1.07201176e+01 8.94878785e+01
1716.lowfreq: -1.1693 -0.0016 -0.0009 0.0008 4.9536 7.6843 22.0943 29.5272 43.2511
frequency: 22.0533 29.5220 43.2503 52.2835 74.4782 91.3114 128.9888 133.9319 159.4118 171.6928 225.0547 239.0153 261.6429 275.9520 347.5375 356.8889 378.1486 393.6059 406.6466 418.2844 494.4853 510.4890 520.2211 540.2337 551.6822 590.1448 608.9665 626.0763 673.5201 690.7745 734.2626 783.5264 797.8003 822.3796 834.0434 853.3002 858.9627 899.5608 912.2509 944.3090 970.4932 985.7429 988.5129 989.0168 994.1748 1003.0905 1005.2370 1014.3839 1032.6441 1075.7073 1112.2466 1136.2459 1157.1483 1170.9979 1183.7622 1193.7205 1237.5004 1292.4468 1304.8837 1312.4179 1348.2554 1372.5799 1386.7788 1390.7253 1429.1104 1444.1537 1447.6626 1458.3267 1463.1666 1475.7581 1558.8267 1581.3337 1582.4245 1599.0581 1602.2800 3006.1706 3094.2956 3129.4201 3136.7626 3140.7297 3153.6316 3154.2076 3159.5952 3166.5249 3173.0420 3175.4066 3197.4815
redmass: 5.0729 5.9584 4.2515 5.2634 4.7783 5.5830 7.5355 7.8829 8.4377 1.0437 7.3680 7.8963 6.0210 5.6634 6.0991 5.6063 6.3613 3.9089 2.9271 3.9754 3.2772 5.2594 5.7076 3.2103 3.0297 4.9902 6.5002 6.8841 6.4651 1.8977 3.5859 1.7837 5.3743 2.0773 2.0855 1.2506 1.7574 7.2114 5.4577 1.4370 1.3814 6.2017 1.3666 1.3662 2.5082 1.3270 1.7927 2.0771 1.6314 1.4936 1.3464 2.1304 1.2588 1.0609 1.9662 2.3091 3.2351 1.5202 1.4876 3.3049 6.7550 6.0639 1.2323 9.1704 4.1515 2.4169 1.0979 1.0475 2.2009 2.4879 7.2976 6.3796 7.4016 6.4772 6.2746 1.0369 1.0974 1.0853 1.1007 1.0888 1.0930 1.0882 1.0902 1.0961 1.0999 1.0963 1.0957
irintensity: 0.8999 0.7091 5.3181 2.0877 1.8168 3.1889 0.7639 3.1567 1.4523 0.3659 17.3695 3.7925 7.4954 1.1308 39.4704 16.1348 15.2197 10.7832 0.0706 2.0453 0.3996 1.8187 22.2710 11.2497 10.9249 48.1191 0.2208 9.8489 15.5431 52.7128 22.4263 34.3208 62.0393 50.0390 10.7307 0.5146 62.5810 0.4670 14.4721 7.7129 3.5885 2.2396 0.2966 0.1947 8.2685 0.7700 36.0798 10.1695 7.9886 10.2553 10.0063 1.5670 48.7969 0.2722 26.2981 64.3679 13.6905 103.8510 24.4047 405.5957 6.1026 13.5729 67.5508 3.1734 20.7537 7.5863 18.8062 20.0804 0.6797 41.2290 7.2329 7.1853 53.8866 1.3001 14.1852 2.3339 6.3730 2.1028 9.2138 9.6184 23.3714 1.0436 2.2966 18.0787 39.4957 2.9428 1.7775
temp: 298.150 k
press: 1.00000 atm
elementType: 17 8 7 7 7 6 6 6 6 6 6 6 6 6 6 6 6 6 6 1 1 1 1 1 1 1 1 1 1 1 1
symmnumber: 1
zpe: 600793.2 jmol-1
zpe.correction: 0.228830 hartree
zpe.thermalcorrener: 0.246185 hartree
zpe.thermalcorrenthalpy: 0.247130 hartree
zpe.thermalcorrgfe: 0.180976 hartree
zpe.sumelectzpe: -1238.824037 hartree
zpe.sumelectthermal: -1238.806681 hartree
zpe.sumelectthermalent: -1238.805737 hartree
zpe.sumelectthermalfe: -1238.871891 hartree
dipole: -0.4801 1.5678 -0.8674
dipole: 1.8550
quadrupole: -83.8064 -113.4937 -121.1651
quadrupole: 6.1081 -3.5477 8.1738
quadrupole: 22.3487 -7.3386 -15.0101 6.1081 -3.5477 8.1738
hfenergy: -1239.0528667 hartree
pointgroup: C01 [X(C14H12Cl1N3O1)]
dipole: -0.207801 0.5104356 0.4784168 debye
polarizability: 509.9181173|3.3946414|91.9012429|5.5719224|18.3095348|180.8086897 unknown
InChI: InChI=1S/C14H12ClN3O/c1-11(19)18(15)14-9-7-13(8-10-14)17-16-12-5-3-2-4-6-12/h2-10H,1H3
charge 0 multiplicity 1
31 atoms
Cl 4.76494 1.211655 1.782294
O  4.78549 -1.340142 -1.311009
N  4.180016 0.069468 0.396906
N  -1.434052 0.038726 -0.51355
N  -2.22625 0.017131 0.530387
C  2.765765 0.065837 0.189832
C  -0.0403 0.047712 -0.195487
C  2.232055 0.127224 -1.126853
C  1.888519 0.006944 1.309879
C  0.839212 0.104499 -1.308682
C  0.500488 0.001145 1.122817
C  -3.623937 0.002424 0.217949
C  5.165823 -0.58081 -0.371992
C  -4.490814 -0.021982 1.342899
C  -4.166328 0.009912 -1.099925
C  -5.888958 -0.039171 1.158445
C  -5.56205 -0.007017 -1.274498
C  -6.427832 -0.031646 -0.149901
C  6.620201 -0.351966 -0.010497
H  2.904037 0.15772 -1.986191
H  2.31194 -0.02843 2.318312
H  0.403847 0.138046 -2.312389
H  -0.187239 -0.045692 1.972025
H  -4.04287 -0.027704 2.342107
H  -3.479483 0.02836 -1.951485
H  -6.555769 -0.058484 2.02711
H  -5.985201 -0.001558 -2.285308
H  -7.513737 -0.045054 -0.295921
H  7.235413 -0.940551 -0.706568
H  6.831714 -0.669854 1.025143
H  6.893956 0.714458 -0.08785
