program: Gaussian 09
title: 000019530
version: EM64L-G09RevD.01
frameworkgroup: C1[X(C3H4BrCl)]
method: RPBEPBE
basis: SDD
operation: Freq
keyword: #p
keyword: freq=noraman
keyword: PBEPBE/SDD
title: #p freq=noraman PBEPBE/SDD
converged: NO YES NO NO
title: Mulliken charges:
elementType: Br Cl C C C H H H H
charge: -0.027220 -0.017894 -0.732559 0.072423 -0.402230 0.295714 0.278452 0.264007 0.269307
chargesum: 0.00000
title: Mulliken charges with hydrogens summed into heavy atoms:
elementType: Br Cl C C C
charge: -0.027220 -0.017894 -0.158393 0.336430 -0.132922
polarizability: 1.02612627e+02 -2.51332754e+00 3.99032238e+01 -3.30601426e+00 1.48542745e+00 3.52196937e+01
1716.lowfreq: -9.5915 -0.0031 -0.0031 -0.0014 4.4337 10.3007 75.8419 149.2034 241.8082
frequency: 75.8121 149.1856 241.7996 264.7760 412.5805 532.8260 743.4454 793.8166 888.4665 943.0645 1070.4927 1134.4915 1201.5778 1247.2432 1280.9913 1449.3542 1627.0603 3066.5186 3145.1269 3162.0565 3186.5893
redmass: 9.6053 2.6296 3.8856 4.6735 4.9609 5.1892 2.7804 1.8730 1.7087 1.1237 1.6814 1.6080 1.1353 1.1751 1.2222 1.1241 6.3181 1.0568 1.1021 1.1022 1.0957
irintensity: 0.3950 2.4832 0.2264 5.2320 24.5485 80.1851 38.5731 5.0616 11.3782 83.6824 2.1050 22.9862 36.5151 12.1458 5.3923 11.1360 96.6808 12.9500 1.6209 5.0614 8.2123
temp: 298.150 k
press: 1.00000 atm
elementType: 35 17 6 6 6 1 1 1 1
symmnumber: 1
zpe: 159206.7 jmol-1
zpe.correction: 0.060639 hartree
zpe.thermalcorrener: 0.066740 hartree
zpe.thermalcorrenthalpy: 0.067685 hartree
zpe.thermalcorrgfe: 0.028577 hartree
zpe.sumelectzpe: -589.819370 hartree
zpe.sumelectthermal: -589.813268 hartree
zpe.sumelectthermalent: -589.812323 hartree
zpe.sumelectthermalfe: -589.851431 hartree
dipole: -0.5106 2.0347 0.2347
dipole: 2.1109
quadrupole: -54.2417 -44.8467 -43.6624
quadrupole: 0.1422 -1.1543 0.9024
quadrupole: -6.6581 2.7369 3.9212 0.1422 -1.1543 0.9024
hfenergy: -589.8800081 hartree
pointgroup: C01 [X(C3H4Br1Cl1)]
dipole: -0.1444377 0.817707 -0.0137144 debye
dipolederiv: -0.722047 0.1259478 -0.0475269 0.4217477 -0.2852958 0.0441342 -0.1577504 0.0245246 -0.1581837 -0.8247985 -0.1287211 -0.0048688 -0.3495651 -0.1009802 -0.038524 -0.1893061 -0.074558 -0.1207683 0.998157 -0.3201949 0.0516158 -0.3933276 0.401219 -0.0954229 0.2879052 -0.0454582 0.1064261 -0.5606006 -0.000561 -0.0233427 -0.1255221 -0.2245356 0.11981 0.1463355 0.0505851 -0.0102805 1.0940294 0.3111394 0.025625 0.4778256 -0.0406016 0.1486689 0.0148123 0.1928951 0.1470363 -0.0630882 0.0267219 0.0109218 0.0503835 -0.0189228 0.0842585 0.0057898 0.0927783 0.0255297 0.0175255 0.1029804 0.0377371 0.0498013 -0.0173359 -0.0712053 -0.0382548 -0.0766213 -0.012782 0.0672969 -0.0282397 -0.0040262 -0.0598313 0.1335495 -0.088272 -0.0249938 -0.0762407 0.0118855 -0.0064745 -0.0890729 -0.046135 -0.071512 0.1529035 -0.1034474 -0.0445375 -0.087905 0.0111368 unknown
polarizability: 102.0410359|-7.2032272|40.8880696|0.4852222|0.711361|34.8064387 unknown
InChI: InChI=1S/C3H4BrCl/c4-2-1-3-5/h1,3H,2H2
charge 0 multiplicity 1
9 atoms
Br 2.639599 -0.726456 0.274145
Cl -2.749766 -0.454991 -0.053822
C  1.245579 0.765074 -0.049226
C  -0.071212 0.181392 -0.433074
C  -1.136143 0.222914 0.402365
H  1.707276 1.354543 -0.854137
H  1.22486 1.330042 0.893533
H  -0.154993 -0.286577 -1.420263
H  -1.136699 0.64976 1.408279
