program: Gaussian 09
title: 000251990
version: EM64L-G09RevD.01
frameworkgroup: C1[X(C13H5Cl2NO3)]
method: RPBEPBE
basis: SDD
operation: Freq
keyword: #p
keyword: freq=noraman
keyword: PBEPBE/SDD
title: #p freq=noraman PBEPBE/SDD
converged: YES YES NO NO
title: Mulliken charges:
elementType: Cl Cl O O O N C C C C C C C C C C C C C H H H H H
charge: -0.007868 -0.021977 -0.137294 -0.185969 -0.207611 0.019825 0.203185 0.345044 0.198379 0.200917 -0.310430 0.276071 -0.417626 -0.337142 -0.389090 -0.321389 -0.104866 -0.211082 -0.107560 0.313795 0.320695 0.306987 0.309511 0.265494
chargesum: 0.00000
title: Mulliken charges with hydrogens summed into heavy atoms:
elementType: Cl Cl O O O N C C C C C C C C C C C C C
charge: -0.007868 -0.021977 -0.137294 -0.185969 -0.207611 0.019825 0.203185 0.345044 0.198379 0.200917 -0.310430 0.276071 -0.103830 -0.016447 -0.082103 -0.011877 -0.104866 0.054411 -0.107560
polarizability: 3.41945524e+02 1.90966206e+00 2.01467752e+02 2.75161104e+00 -8.13465615e-01 6.31918520e+01
1716.lowfreq: -4.7206 -0.0028 -0.0025 -0.0012 2.1197 4.5025 26.9573 40.1106 66.5110
frequency: 26.9375 40.1023 66.5090 123.3893 124.4563 147.7065 171.5675 185.7941 202.5997 236.1126 241.9149 293.4097 329.2495 364.7017 374.4870 388.1816 416.6453 433.5513 461.8098 498.6678 536.8564 562.9210 597.8686 615.0247 656.8134 662.0923 697.0268 712.5390 727.7968 762.3542 814.9457 815.6014 852.7238 858.9803 914.1635 924.8739 946.2740 962.5829 988.2367 1000.8875 1063.8827 1083.0705 1110.0897 1155.7431 1177.2508 1197.4508 1204.6553 1231.6233 1264.8585 1338.6574 1366.4842 1385.2895 1415.4294 1422.8888 1436.5874 1470.1187 1557.8783 1574.2459 1595.6468 1608.3845 1639.1262 3168.9222 3169.6333 3170.0902 3189.6586 3222.8156
redmass: 15.8978 15.7263 7.7682 14.8122 12.8266 6.3645 16.5270 5.1165 13.8790 7.8133 12.9878 12.0176 8.1718 9.0536 7.8603 8.0059 4.7350 7.5394 4.5923 6.1280 6.6511 3.3474 8.7064 7.1739 6.0285 7.2171 9.3921 7.8990 8.3966 5.5698 4.2796 6.6471 1.4195 9.8752 1.4369 1.4777 1.6108 8.2668 1.3830 6.1349 2.0350 1.8967 2.3525 2.9649 2.6471 2.6831 5.0540 2.5813 1.3961 3.3349 10.5682 8.1392 4.4586 3.1493 2.9523 7.1302 9.2844 8.1337 8.0389 8.3936 12.3016 1.0928 1.0933 1.0939 1.0921 1.0934
irintensity: 0.2521 0.9635 3.1584 1.3073 1.2633 0.5126 0.8674 0.0749 2.6200 0.8504 0.1955 2.0856 1.1218 3.5120 7.4965 3.9681 5.4374 12.3611 9.5191 20.6797 0.7544 0.3861 4.3618 5.4041 3.4257 3.2812 81.6039 5.5994 20.2785 8.0367 13.7712 8.3594 32.6574 41.1034 3.9460 27.4293 11.1937 17.9798 2.2757 3.6832 20.6649 2.8404 3.3097 15.4140 63.1553 96.4987 256.3118 119.2458 4.6584 7.1434 10.0550 90.5585 7.0419 331.9009 31.6458 7.9158 83.8336 10.1196 65.0322 11.0382 114.5830 0.0080 1.2493 4.1693 12.1552 8.4613
temp: 298.150 k
press: 1.00000 atm
elementType: 17 17 8 8 8 7 6 6 6 6 6 6 6 6 6 6 6 6 6 1 1 1 1 1
symmnumber: 1
zpe: 388540.1 jmol-1
zpe.correction: 0.147987 hartree
zpe.thermalcorrener: 0.163156 hartree
zpe.thermalcorrenthalpy: 0.164100 hartree
zpe.thermalcorrgfe: 0.103756 hartree
zpe.sumelectzpe: -1697.560333 hartree
zpe.sumelectthermal: -1697.545164 hartree
zpe.sumelectthermalent: -1697.544220 hartree
zpe.sumelectthermalfe: -1697.604564 hartree
dipole: 0.4193 -0.3268 -0.0478
dipole: 0.5338
quadrupole: -122.8006 -137.2533 -121.6550
quadrupole: 8.7347 -1.0381 -0.0314
quadrupole: 4.4357 -10.0170 5.5813 8.7347 -1.0381 -0.0314
hfenergy: -1697.7083199 hartree
pointgroup: C01 [X(C13H5Cl2N1O3)]
dipole: 0.1698841 -0.121923 -0.0193936 debye
dipolederiv: -0.8743806 -0.2964636 -0.0039419 -0.3276264 -0.1965034 -0.0016805 -0.0037566 -0.0047298 -0.0346666 -1.1167605 0.0482489 0.0136508 0.0850264 -0.0983388 -0.0006724 0.0241419 -0.0028292 -0.0449041 -0.4876805 0.0680848 0.0017295 0.0284736 -0.9931907 0.0088994 0.0007162 0.0012218 -0.2844603 -0.7770285 0.264326 -0.1168576 0.3697542 -0.690409 0.0513336 -0.1338374 0.0474547 -0.243004 -0.4990143 -0.1654225 -0.1375462 -0.0547846 -0.6548672 -0.0545618 -0.0849863 -0.03564 -0.2521383 0.9787001 -0.0895063 0.2886319 -0.5832309 1.6590531 0.0087242 0.2396056 -0.0158133 0.2600688 0.7162821 -0.3750099 -0.0123672 0.2056768 0.0730048 0.000355 0.0033121 -0.0415288 0.0197607 -0.3344309 0.2346308 0.0058414 0.0632363 0.0696906 -0.0027958 0.0131556 0.000634 -0.0165876 -0.6947066 0.1384903 0.0039083 -0.1898858 -0.1351737 0.002944 0.0028387 -0.0028402 0.0461613 -0.3704098 -0.3329266 0.0061169 -0.465357 -0.2459163 0.0090092 0.0105538 0.0023749 0.0442218 1.1890591 0.0206389 -0.0112439 0.0226594 1.2025224 -0.0119322 -0.0058572 -0.0023367 0.1110465 -0.0056242 0.1065719 -0.0367009 0.3721 -0.5520083 -0.0072278 -0.0160942 0.0086168 0.0553418 0.0375672 -0.1845493 -0.0012807 0.0008495 0.1013729 -0.0023059 -0.0008392 -0.0000744 -0.0457753 0.0315384 -0.2502561 -0.00724 0.1321534 -0.0382023 -0.0022376 0.0042087 0.0096685 -0.0925317 -0.3892234 0.0697095 0.0030223 -0.2450816 0.0736331 0.0034473 0.0063239 -0.0018578 -0.0635781 -0.4515559 0.06985 -0.000789 -0.4311391 -0.0275532 -0.0053925 -0.0121653 0.0408489 -0.0444841 1.2302169 0.5469599 0.0107175 0.8540184 0.0734167 0.0031636 0.0090219 0.0102011 -0.0834097 -0.3596561 0.2076502 0.0021378 0.2819379 -0.02581 -0.0002278 -0.0110585 0.0078984 -0.0840741 1.6264576 -0.0707127 -0.0250699 -0.1023225 0.0611903 0.0010369 -0.0387933 0.0054464 -0.0677157 0.1322144 0.0132661 -0.0001832 -0.0266989 0.059026 0.0002137 -0.001161 -0.0025954 0.1642403 0.1715904 0.0265759 0.0100277 -0.0085795 0.0653391 -0.000726 -0.0000393 -0.0101317 0.161182 0.0956889 0.0093482 0.0011584 0.0442051 0.0488155 -0.0007299 -0.0002693 -0.0005616 0.1667499 0.1181292 -0.0021308 0.0035302 0.0384935 0.1387108 0.0006336 -0.0100101 -0.0111809 0.1694479 0.0330271 -0.0573736 0.0027479 -0.0638785 0.0321976 0.0007295 0.0049895 -0.0022456 0.1591088 unknown
polarizability: 341.5823639|7.4230786|201.8392631|2.5396959|-0.2323841|63.1835012 unknown
InChI: InChI=1S/C13H5Cl2NO3/c14-6-1-2-8-9(3-6)13(17)10-4-7(15)5-11(12(8)10)16(18)19/h1-5H
charge 0 multiplicity 1
24 atoms
Cl -4.843356 -1.668942 -0.023033
Cl 5.564132 -0.147856 -0.066651
O  0.67199 -3.25183 0.019602
O  -2.764884 3.091269 -0.26842
O  -0.57428 3.061636 0.327866
N  -1.674205 2.464928 0.01831
C  -0.539909 0.158671 0.029672
C  0.949538 0.354974 0.020774
C  -0.78816 -1.256948 0.02391
C  1.565698 -0.93996 0.008002
C  0.517562 -2.002342 0.018268
C  -1.699244 0.978583 0.009622
C  -2.056006 -1.84284 0.012789
C  1.78668 1.492223 0.010603
C  2.953251 -1.130403 -0.015957
C  -3.006342 0.414202 -0.01511
C  -3.171203 -0.975169 -0.006539
C  3.194513 1.320523 -0.022527
C  3.758405 0.028738 -0.033341
H  -2.160866 -2.931823 0.013886
H  1.372059 2.497917 0.038326
H  3.379248 -2.137761 -0.023035
H  -3.863535 1.090889 -0.042039
H  3.847112 2.198323 -0.032678
