program: Gaussian 09
title: 000251984
version: EM64L-G09RevD.01
frameworkgroup: C1[X(C13H5Cl2NO3)]
method: RPBEPBE
basis: SDD
operation: Freq
keyword: #p
keyword: freq=noraman
keyword: PBEPBE/SDD
title: #p freq=noraman PBEPBE/SDD
converged: NO YES YES YES
title: Mulliken charges:
elementType: Cl Cl O O O N C C C C C C C C C C C C C H H H H H
charge: 0.022170 0.023377 -0.128753 -0.202161 -0.193400 0.021394 0.290507 0.324295 0.239783 0.224153 -0.291839 -0.357597 -0.549578 -0.360996 -0.396520 0.412874 -0.372601 -0.076498 -0.100801 0.259574 0.331917 0.278028 0.307981 0.294690
chargesum: 0.00000
title: Mulliken charges with hydrogens summed into heavy atoms:
elementType: Cl Cl O O O N C C C C C C C C C C C C C
charge: 0.022170 0.023377 -0.128753 -0.202161 -0.193400 0.021394 0.290507 0.324295 0.239783 0.224153 -0.291839 -0.098023 -0.217661 -0.082968 -0.088539 0.412874 -0.077911 -0.076498 -0.100801
polarizability: 3.67868834e+02 -1.14138704e+00 1.95035652e+02 -3.18036909e-04 8.77325771e-03 6.19871727e+01
1716.lowfreq: -2.8357 -0.0015 0.0003 0.0016 4.0833 4.2278 39.8226 50.3639 69.7936
frequency: 39.8174 50.3618 69.7922 97.2391 119.5656 154.7118 181.7302 191.4518 193.4406 236.9728 250.5244 271.4713 299.5270 360.7899 403.1167 423.8299 445.2608 445.5058 481.8477 499.0512 536.1251 595.1063 595.9575 601.0658 651.3228 671.1316 679.3005 705.3691 731.6566 764.1336 770.2025 821.1173 859.2286 864.3698 893.9440 921.3669 953.0503 968.9145 996.3505 1016.0714 1054.8166 1095.6645 1110.2041 1138.2356 1173.1961 1206.3538 1224.5486 1228.7214 1270.9565 1357.3419 1361.1002 1374.1185 1405.5294 1436.6331 1440.1213 1479.3298 1582.7275 1591.2569 1599.9759 1614.3439 1641.1124 3153.4408 3165.5243 3170.6913 3180.1610 3184.8696
redmass: 13.8254 15.7703 11.4225 12.9221 9.5509 5.8328 23.4323 14.3923 5.3524 16.2857 8.1925 12.6697 10.5933 6.6669 11.8259 3.3801 3.2459 9.2917 5.4983 9.2117 6.1112 8.2548 6.3855 6.3521 7.4673 6.4745 10.0005 4.8824 6.2719 11.0988 3.6809 3.8815 9.3437 1.4334 1.6188 1.5263 5.8033 1.5884 1.3853 4.9639 1.9445 2.0107 3.2455 2.1722 4.1868 6.4479 2.9415 1.2894 1.7644 6.1788 6.6880 8.9957 4.7196 3.5189 3.3906 6.1227 9.9219 8.3339 8.3142 8.2268 11.4104 1.0910 1.0931 1.0936 1.0934 1.0950
irintensity: 1.0150 0.0293 2.4503 1.6879 0.0759 1.7093 0.3516 1.7001 2.2879 0.3660 0.8088 2.3210 0.2514 0.8623 13.6638 10.4750 1.5765 7.0586 5.4368 1.6998 12.9836 3.8493 0.2236 7.9438 8.3060 10.5799 26.3422 11.4878 0.1666 17.0719 0.0890 13.0161 25.5706 43.9785 5.0348 9.5459 31.8418 25.0335 0.5341 11.5071 46.0283 24.9465 10.4631 150.8467 84.5929 327.2374 203.9542 0.2170 28.0015 14.9834 45.8384 118.4666 56.6210 26.2989 9.5103 6.3619 15.8958 137.2869 13.8507 149.1716 137.0647 4.1730 0.1230 1.9476 7.3815 2.8536
temp: 298.150 k
press: 1.00000 atm
elementType: 17 17 8 8 8 7 6 6 6 6 6 6 6 6 6 6 6 6 6 1 1 1 1 1
symmnumber: 1
zpe: 389102.0 jmol-1
zpe.correction: 0.148201 hartree
zpe.thermalcorrener: 0.163292 hartree
zpe.thermalcorrenthalpy: 0.164236 hartree
zpe.thermalcorrgfe: 0.104425 hartree
zpe.sumelectzpe: -1697.563091 hartree
zpe.sumelectthermal: -1697.548000 hartree
zpe.sumelectthermalent: -1697.547056 hartree
zpe.sumelectthermalfe: -1697.606867 hartree
dipole: -3.6140 -3.4191 0.0009
dipole: 4.9750
quadrupole: -159.6414 -121.7424 -121.2696
quadrupole: -5.2522 0.0041 0.0006
quadrupole: -25.4236 12.4754 12.9482 -5.2522 0.0041 0.0006
hfenergy: -1697.7112918 hartree
pointgroup: C01 [X(C13H5Cl2N1O3)]
dipole: -1.3819304 1.3861519 -0.0003466 debye
dipolederiv: -0.5196282 0.3521628 0.0000456 0.4938151 -0.3988443 -0.0000477 0.0000734 -0.0000497 -0.0119734 -0.895303 -0.2134901 0.0000239 -0.299799 -0.1080691 0.0000073 0.0000383 0.0000132 -0.0096578 -0.5197603 0.0556029 0.00002 0.0894021 -1.0107949 -0.0001746 -0.0000091 0.0000984 -0.2817238 -0.9691575 -0.2103912 -0.0000312 -0.3273812 -0.6111229 0.0000261 -0.0002141 -0.0001371 -0.2242558 -0.817472 0.1677663 -0.0000142 0.340203 -0.6546254 -0.000087 -0.000124 0.0000805 -0.2193318 2.3308949 0.0047664 0.0001352 -0.1302364 1.0447092 0.000052 0.0002537 0.0000699 0.1865503 0.7935733 0.1756124 0.0000013 0.1178438 0.145997 0.0000127 -0.0000793 -0.0000208 0.0176306 -0.1391319 -0.143783 -0.0000036 -0.1349275 0.1004016 0.0000158 0.0000942 -0.0000075 -0.00187 -0.8732359 -0.1537035 -0.0000175 0.0952148 -0.2581772 -0.000005 -0.0000318 -0.0000356 0.0295355 -0.712244 0.3002149 0.0000364 0.3133105 -0.2214848 -0.0000126 0.0000853 -0.0000408 0.0263659 1.3689808 -0.0986996 -0.0000401 -0.0601281 1.2342898 0.0001862 -0.0000249 0.0000296 0.1191056 -0.6295363 -0.2578197 -0.0000363 -0.2945564 0.0604343 0.0000061 -0.0000156 0.0000187 -0.1295099 0.4558682 -0.0292927 0.0000068 0.1192837 0.0083469 0.0000303 0.0000837 -0.0000037 -0.0659973 -0.2575604 0.2786745 0.0000413 0.0330749 -0.0503405 -0.0000058 0.0000008 -0.0000104 -0.0794717 -0.113081 -0.1829101 -0.0000097 0.1278377 0.0908372 0.0000147 0.0000202 0.0000223 -0.0421072 -1.0047797 0.0352563 -0.0000702 0.1017803 -0.0194904 0.0000052 -0.0000419 -0.0000086 0.0480692 0.3736783 0.1355328 0.0000244 -0.2652824 -0.0320764 -0.0000141 0.0000678 0.0000134 -0.0816224 0.5402848 -0.7169284 -0.0000874 -0.9405654 0.5485374 0.0000677 -0.0001038 0.0000853 -0.0301631 1.1195779 0.5014711 -0.0000311 0.6389201 -0.0755393 -0.0000285 -0.0000395 -0.0000442 -0.0656548 0.0550191 0.0788515 0.0000018 0.0533353 -0.0229568 -0.0000134 0.0000047 -0.0000177 0.1512295 0.1417059 0.0120981 0.0000009 0.0029725 0.0961858 -0.0000079 -0.0000094 -0.0000089 0.1718432 0.0821989 -0.0450054 0.0000011 -0.0247293 0.0008038 -0.0000116 -0.000015 -0.0000124 0.1594477 0.0915676 0.0105523 0.0000056 -0.0309187 0.0467373 -0.0000081 0.0000045 -0.0000148 0.1647111 0.0975406 -0.0565386 -0.000003 -0.0184696 0.0862416 -0.0000078 -0.0000182 -0.0000188 0.1688502 unknown
polarizability: 367.7878592|-3.9104188|195.1166271|0.0005743|0.0087602|61.9871727 unknown
InChI: InChI=1S/C13H5Cl2NO3/c14-11-4-8-7-2-1-6(16(18)19)3-9(7)13(17)10(8)5-12(11)15/h1-5H
charge 0 multiplicity 1
24 atoms
Cl -4.803241 2.25819 0.000355
Cl -5.533024 -0.926929 0.000197
O  -0.077428 -2.956783 -0.000068
O  5.312472 1.189307 0.0005
O  5.064439 -1.079506 0.000329
N  4.588455 0.119795 0.000103
C  0.342059 0.629859 -0.000033
C  -1.135107 0.491999 -0.000022
C  0.916184 -0.679778 -0.000131
C  -1.461791 -0.897076 -0.000106
C  -0.191424 -1.703761 -0.000349
C  1.170111 1.767707 0.000088
C  2.299869 -0.881852 -0.000075
C  -2.153679 1.457723 0.000112
C  -2.789441 -1.341991 -0.000025
C  3.111824 0.279008 0.000054
C  2.572947 1.586571 0.000125
C  -3.498734 1.011669 0.000182
C  -3.81674 -0.369098 0.000121
H  0.752757 2.779305 0.000172
H  2.745249 -1.880189 -0.000149
H  -1.944782 2.531166 0.000187
H  -3.028129 -2.409402 -0.0001
H  3.260052 2.436964 0.000231
