program: Gaussian 09
title: 000251985
version: EM64L-G09RevD.01
frameworkgroup: C1[X(C15H9BrFNO2)]
method: RPBEPBE
basis: SDD
operation: Freq
keyword: #p
keyword: freq=noraman
keyword: PBEPBE/SDD
title: #p freq=noraman PBEPBE/SDD
converged: NO YES NO NO
title: Mulliken charges:
elementType: Br F O O N C C C C C C C C C C C C C C C H H H H H H H H H
charge: 0.029216 -0.195050 -0.137120 -0.241271 -0.450021 0.304668 0.250096 0.297768 0.221146 -0.301281 -0.540739 -0.380766 0.709158 -0.360738 -0.563963 -0.554392 -0.368784 0.347201 0.218578 -0.795985 0.358841 0.264949 0.251537 0.306265 0.260833 0.312783 0.242521 0.272059 0.242491
chargesum: 0.00000
title: Mulliken charges with hydrogens summed into heavy atoms:
elementType: Br F O O N C C C C C C C C C C C C C C C
charge: 0.029216 -0.195050 -0.137120 -0.241271 -0.137238 0.304668 0.250096 0.297768 0.221146 -0.301281 -0.181898 -0.115817 0.709158 -0.109201 -0.257698 -0.554392 -0.107951 0.347201 0.218578 -0.038914
polarizability: 3.54487100e+02 7.72525796e+00 2.23502700e+02 1.67226832e-03 6.38720992e-04 7.40513865e+01
1716.lowfreq: -65.3189 -4.0685 -0.0011 -0.0007 -0.0003 4.5062 5.8618 36.5264 55.5694
frequency: -65.3180 36.5202 55.5651 62.0084 90.0387 100.1627 116.8560 142.9230 175.0272 198.4115 215.1274 220.3277 248.7310 267.2084 291.9321 373.5902 396.3898 400.2039 431.6845 442.1426 443.9378 512.7741 516.2736 543.7598 577.3137 589.1418 619.7983 623.7681 647.4481 682.5645 717.6560 721.3104 734.7811 765.2973 782.0054 823.8280 834.7729 887.5172 902.9539 911.2034 935.1603 952.7665 971.2701 974.5392 997.6539 1020.1855 1033.8357 1069.4145 1121.6512 1135.3109 1180.1133 1205.8941 1223.8487 1235.1157 1258.4754 1291.7329 1342.1214 1369.4043 1377.7631 1423.2702 1432.9980 1448.2704 1453.1489 1466.7232 1482.9642 1502.2536 1581.2200 1601.1162 1606.7379 1620.6401 1636.0215 1642.8675 2989.0107 3074.1354 3139.5690 3146.8318 3163.0061 3172.1468 3177.3244 3179.9745 3475.2077
redmass: 1.0405 7.2635 7.2527 6.1951 7.2158 5.7494 9.1991 5.3199 7.0242 10.0934 5.2505 21.1534 12.4521 4.6627 6.6102 7.6393 6.1720 4.3739 4.3962 6.2757 3.3872 4.6145 5.9880 5.3558 3.1067 7.8589 5.4039 3.8896 7.7577 1.3809 7.2866 3.7299 6.1635 3.3439 6.8862 3.7295 1.4405 1.5639 5.0101 1.6006 6.1234 1.3918 2.3533 1.5264 3.1505 2.4997 1.6677 2.4263 1.7741 2.6272 2.1297 5.4199 2.5463 1.4861 1.4946 3.5028 4.8218 4.8766 1.2389 3.2093 4.0808 1.5394 2.4549 1.0463 5.0777 2.0017 7.3028 8.5211 8.1006 7.9209 7.1521 6.6659 1.0384 1.0983 1.0981 1.0902 1.0928 1.0938 1.0958 1.0935 1.0764
irintensity: 0.2842 0.3661 0.8949 10.7055 1.0374 0.0954 2.7642 0.1138 1.9890 0.1661 0.5531 0.9408 6.0202 3.1907 0.8255 3.1195 8.9154 0.0021 11.9386 20.8098 0.8086 18.9870 3.2302 0.2781 0.0013 6.7809 23.0785 0.0183 1.5183 49.2990 6.4795 23.8521 2.0581 1.2948 62.0398 31.6579 35.9278 10.3688 28.5211 12.9025 12.6063 0.0119 55.4300 33.8466 29.2660 3.9403 8.3433 2.7937 14.9364 1.6617 88.9639 66.2869 124.2822 61.7371 6.8730 71.6629 168.6430 9.6626 66.2880 94.8200 85.9873 35.2012 326.0973 20.7219 11.3567 496.1354 88.8941 89.6406 90.7166 28.1799 0.1460 153.3164 5.5476 12.3962 6.4803 6.0519 1.1505 1.5305 5.5192 19.2857 46.6775
temp: 298.150 k
press: 1.00000 atm
elementType: 35 9 8 8 7 6 6 6 6 6 6 6 6 6 6 6 6 6 6 6 1 1 1 1 1 1 1 1 1
symmnumber: 1
zpe: 527640.8 jmol-1
zpe.correction: 0.200968 hartree
zpe.thermalcorrener: 0.217354 hartree
zpe.thermalcorrenthalpy: 0.218299 hartree
zpe.thermalcorrgfe: 0.155406 hartree
zpe.sumelectzpe: -894.157378 hartree
zpe.sumelectthermal: -894.140991 hartree
zpe.sumelectthermalent: -894.140047 hartree
zpe.sumelectthermalfe: -894.202940 hartree
dipole: 3.6280 -5.6278 0.0005
dipole: 6.6959
quadrupole: -111.2575 -135.6937 -125.6048
quadrupole: 6.9231 0.0019 0.0017
quadrupole: 12.9279 -11.5084 -1.4195 6.9231 0.0019 0.0017
hfenergy: -894.3583454 hartree
pointgroup: C01 [X(C15H9Br1F1N1O2)]
dipole: -1.0576276 2.4127278 0.0035213 debye
polarizability: 353.6063256|-13.2011561|224.3831993|-0.0341458|0.2028472|74.0516612 unknown
InChI: InChI=1S/C15H9BrFNO2/c1-7(19)18-14-6-12-10(5-13(14)16)9-3-2-8(17)4-11(9)15(12)20/h2-6,18H,1H3
charge 0 multiplicity 1
29 atoms
Br -2.956711 3.262368 0.004395
F  5.940218 -0.562053 -0.00127
O  0.903594 -2.800992 -0.003912
O  -4.065829 -2.096931 -0.002971
N  -3.784971 0.238394 0.000444
C  0.448577 0.775297 0.000934
C  -0.117841 -0.532896 -0.000773
C  1.9283 0.660484 0.000675
C  2.266904 -0.726797 -0.001196
C  0.999342 -1.5450 -0.002162
C  -1.497256 -0.759056 -0.001001
C  -0.398435 1.894809 0.002477
C  -2.379201 0.367333 0.000541
C  2.944324 1.633666 0.001884
C  3.596746 -1.170251 -0.001895
C  -1.792775 1.670884 0.00225
C  4.297923 1.20962 0.001214
C  4.588915 -0.168396 -0.000638
C  -4.559452 -0.934997 -0.001272
C  -6.062471 -0.66574 -0.000681
H  -1.917053 -1.767483 -0.002331
H  -0.010985 2.917255 0.003815
H  2.714617 2.704013 0.00332
H  3.854093 -2.23327 -0.003334
H  5.120703 1.930623 0.002105
H  -4.303083 1.123411 0.00177
H  -6.365138 -0.093197 0.895598
H  -6.591667 -1.628916 -0.002408
H  -6.365284 -0.089882 -0.894782
