program: Gaussian 09
title: 000251983
version: EM64L-G09RevD.01
frameworkgroup: C1[X(C13H9ClN2O)]
method: RPBEPBE
basis: SDD
operation: Freq
keyword: #p
keyword: freq=noraman
keyword: PBEPBE/SDD
title: #p freq=noraman PBEPBE/SDD
converged: NO YES NO YES
title: Mulliken charges:
elementType: Cl O N N C C C C C C C C C C C C C H H H H H H H H H
charge: -0.070673 -0.163588 -0.690351 -0.700965 0.336546 0.288743 0.234936 0.232071 -0.326388 -0.437961 -0.621930 -0.382992 -0.632482 0.664664 0.544906 -0.364561 -0.436427 0.264452 0.274250 0.239796 0.271442 0.219520 0.319443 0.316263 0.308004 0.313281
chargesum: 0.00000
title: Mulliken charges with hydrogens summed into heavy atoms:
elementType: Cl O N N C C C C C C C C C C C C C
charge: -0.070673 -0.163588 -0.054646 -0.079680 0.336546 0.288743 0.234936 0.232071 -0.326388 -0.173509 -0.347680 -0.143195 -0.361040 0.664664 0.544906 -0.364561 -0.216907
polarizability: 3.35600761e+02 -1.13794225e+01 1.84298541e+02 -5.04215194e-03 -6.98275436e-03 6.30275182e+01
1716.lowfreq: -5.5765 -3.7843 -3.5451 -0.0009 0.0014 0.0021 57.5997 75.4232 122.6818
frequency: 57.5932 75.4190 122.6768 133.6542 165.3470 211.4388 231.5949 252.3715 273.7750 288.5584 328.1912 366.0889 370.3821 373.5327 383.2960 398.1554 417.8201 431.6567 453.0636 485.9307 525.3008 530.3828 553.4125 599.1096 628.4725 654.3180 705.6562 708.1730 736.3001 759.7078 790.2741 813.1006 826.2501 879.0652 890.2800 920.2046 922.2769 944.1354 987.0767 1004.6120 1030.1863 1053.3390 1082.5972 1133.0850 1158.8604 1208.3661 1243.5265 1264.9179 1312.7330 1322.9337 1365.2517 1387.1049 1444.4006 1473.6138 1482.6672 1500.8796 1578.1630 1591.9743 1616.6018 1625.6217 1638.4668 1645.2519 1650.4096 3120.3978 3131.6937 3136.4545 3144.1267 3160.9991 3555.4912 3566.4478 3702.5884 3706.7214
redmass: 5.5263 7.6039 7.1875 5.5809 5.2457 4.9693 7.8472 7.4864 4.8580 7.3102 5.5776 1.0762 1.2403 3.6661 1.3134 2.8649 2.9690 2.9526 1.2034 4.4923 4.7909 6.9657 5.0206 6.7502 4.0020 7.7490 4.6147 6.8820 5.8271 3.2738 6.9660 2.9941 1.5092 1.5282 1.5611 4.1254 2.2154 1.4080 2.9127 3.0398 1.5168 1.6545 3.0169 1.9383 2.1769 1.9178 1.3058 1.8110 2.6744 3.4157 7.6819 3.3098 3.8362 7.4569 4.6671 4.6656 8.4405 7.4695 4.1928 1.7632 1.9739 1.9458 4.3101 1.0873 1.0922 1.0922 1.0965 1.0926 1.0453 1.0450 1.1038 1.1041
irintensity: 4.9789 2.9190 1.9026 0.1817 0.0643 0.1367 5.9386 1.7168 9.8447 2.4239 1.3923 0.5282 198.0576 2.4737 262.0101 7.5093 29.4238 15.2009 125.2049 5.5415 8.4061 11.8227 4.4401 6.9641 2.7148 1.8588 1.0514 17.7258 1.6711 0.0087 42.4747 33.3523 44.1018 8.6835 0.1884 5.7222 45.1437 0.7341 81.0358 7.4337 9.5094 17.1631 5.5741 7.7031 37.5659 4.7828 1.5499 25.2020 83.3415 47.2725 8.1667 8.0826 4.0928 15.3600 596.1708 50.2877 108.5203 27.2886 159.9282 138.1368 38.8937 423.6725 1.7696 19.6337 14.0687 8.6036 22.4649 2.2200 153.5157 118.2781 34.4463 22.5724
temp: 298.150 k
press: 1.00000 atm
elementType: 17 8 7 7 6 6 6 6 6 6 6 6 6 6 6 6 6 1 1 1 1 1 1 1 1 1
symmnumber: 1
zpe: 497853.0 jmol-1
zpe.correction: 0.189622 hartree
zpe.thermalcorrener: 0.203836 hartree
zpe.thermalcorrenthalpy: 0.204780 hartree
zpe.thermalcorrgfe: 0.149071 hartree
zpe.sumelectzpe: -1144.438348 hartree
zpe.sumelectthermal: -1144.424135 hartree
zpe.sumelectthermalent: -1144.423191 hartree
zpe.sumelectthermalfe: -1144.478899 hartree
dipole: 1.5323 -1.6541 0.0113
dipole: 2.2548
quadrupole: -62.4764 -103.4387 -111.1001
quadrupole: -17.1576 -0.0577 0.0099
quadrupole: 29.8620 -11.1003 -18.7617 -17.1576 -0.0577 0.0099
hfenergy: -1144.6279704 hartree
pointgroup: C01 [X(C13H9Cl1N2O1)]
dipole: 0.6524883 0.6010055 -0.0044555 debye
dipolederiv: -0.6634619 0.3531776 -0.0003476 0.4532264 -0.4328192 0.0001598 -0.0005501 0.0003313 -0.0689249 -0.5450978 0.0744193 -0.000014 0.0979511 -1.1118632 0.0000135 0.0000813 -0.0005278 -0.3053598 -1.8028506 -0.4636268 0.0019865 -0.5715419 -0.2578926 0.0000007 0.0076371 0.0017944 -0.7057509 -2.0339222 0.0815254 -0.0002241 0.1867851 -0.0826197 -0.0003408 -0.0009213 -0.0003046 -0.7459823 0.3309555 -0.1416686 0.0001587 0.0289898 -0.1195938 -0.0000489 -0.0000518 0.0001457 -0.0282281 0.0039787 0.2056461 -0.0000897 0.0231709 -0.1499902 -0.0000047 0.0002765 -0.0000289 -0.0475452 -0.6200327 0.4405197 -0.0001362 0.0232394 -0.0653428 -0.0000313 -0.0000946 -0.0000656 0.0392704 -0.3616769 -0.4348319 -0.0000349 -0.1980315 -0.1518974 -0.0001054 -0.0000055 0.000018 0.0488373 1.2956586 -0.074401 0.0000559 -0.0646986 1.3312693 0.000124 -0.0000838 0.0004503 0.1017425 -0.1362939 0.0720406 -0.0003283 0.2774969 -0.0214803 0.0000035 -0.000171 0.000037 -0.0854882 -0.1328379 -0.3763374 0.0003122 0.3565088 0.1396192 0.0000711 -0.0003436 -0.000236 -0.1765374 0.1876547 -0.0037117 -0.0000094 -0.0700224 0.1203226 0.0000073 -0.0000135 0.0000231 -0.122102 -0.3290325 0.1816583 -0.0001242 -0.4929272 0.1019114 0.0000351 -0.0000166 0.0000289 -0.1917231 1.4997698 0.6761681 -0.0016879 0.8383997 -0.0868944 -0.0001824 -0.0026285 -0.000239 0.1335306 2.032929 -0.0900806 0.0004246 -0.2566297 -0.0930538 0.0000616 0.0009614 0.0001176 0.1368685 0.5311908 -0.5049827 0.0007665 -1.2497549 0.4686008 -0.0002925 0.0011578 -0.0005616 -0.1174188 -0.4397305 -0.0164552 -0.0001288 0.6156159 0.0430428 -0.0000534 -0.0004762 -0.0001346 -0.2217429 0.103947 -0.0376724 -0.000002 -0.0209801 -0.0321324 0.0000436 -0.0001251 0.0001267 0.1576518 0.0453772 -0.0219952 -0.0000201 -0.0632363 -0.034634 -0.0000861 0.0000812 -0.0000276 0.1710762 0.0689778 0.0924357 0.000011 0.0529483 -0.0690943 0.0000133 0.0000314 0.0000174 0.1476006 0.0268361 0.0490926 0.0000228 0.0914892 -0.0169476 -0.000038 0.0000005 -0.0000439 0.1694227 -0.0631915 -0.1183495 0.0000517 -0.1194614 -0.0375329 0.0000513 0.000001 0.0000758 0.1668578 0.2908656 0.0210533 -0.0003685 -0.0247837 0.1682939 0.0005964 -0.0030452 0.0000532 0.3795496 0.2279881 0.0519805 -0.0002321 0.1192778 0.1562494 -0.000266 -0.0020591 -0.0012821 0.3857038 0.244101 0.0096429 -0.0000295 0.0567863 0.1135411 0.0001755 0.0003421 0.000157 0.3894584 0.2378986 -0.0252471 -0.0000128 -0.0898177 0.1209382 0.0000931 0.0000156 0.0000753 0.3892334 unknown
polarizability: 336.4485469|-0.707503|183.450755|0.0044733|-0.0073601|63.0275182 unknown
InChI: InChI=1S/C13H9ClN2O/c14-11-4-8-7-2-1-6(15)3-9(7)13(17)10(8)5-12(11)16/h1-5H,15-16H2
charge 0 multiplicity 1
26 atoms
Cl -4.310551 2.141101 -0.000666
O  0.567909 -2.925784 -0.000439
N  -4.576732 -0.886026 0.001674
N  5.14345 0.18064 0.000836
C  -0.550463 0.505023 0.000588
C  0.922658 0.668226 0.000629
C  -0.856032 -0.89122 0.000511
C  1.520943 -0.629432 0.0005
C  0.432252 -1.67031 0.000544
C  -1.605309 1.434237 0.000523
C  -2.165925 -1.375069 0.000236
C  1.756699 1.800143 0.000324
C  2.905164 -0.819926 0.000305
C  -3.258339 -0.449833 0.000337
C  3.756115 0.330328 0.000366
C  -2.925806 0.93685 0.000469
C  3.162076 1.628588 0.000213
H  -1.433194 2.514361 0.000227
H  -2.354814 -2.454743 0.000007
H  1.340726 2.813852 0.000255
H  3.320949 -1.834374 0.000038
H  3.813171 2.511499 -0.000122
H  -5.338472 -0.212144 -0.002704
H  -4.791457 -1.878207 -0.000552
H  5.756838 0.990068 0.00025
H  5.566344 -0.742746 0.001251
