program: Gaussian 09
title: 000251978
version: EM64L-G09RevD.01
frameworkgroup: C1[X(C15H11ClFNO2)]
method: RPBEPBE
basis: SDD
operation: Freq
keyword: #p
keyword: freq=noraman
keyword: PBEPBE/SDD
title: #p freq=noraman PBEPBE/SDD
converged: YES YES NO NO
title: Mulliken charges:
elementType: Cl F O O N C C C C C C C C C C C C C C C H H H H H H H H H H H
charge: -0.062935 -0.202743 -0.424756 -0.249737 -0.445025 -0.319711 0.224347 0.234311 0.223675 0.188622 -0.540141 -0.429119 -0.559348 -0.349486 0.686555 -0.437343 0.352219 -0.382997 0.217869 -0.796645 0.259958 0.341619 0.266908 0.288163 0.245798 0.257725 0.342060 0.318528 0.240628 0.269863 0.241137
chargesum: 0.00000
title: Mulliken charges with hydrogens summed into heavy atoms:
elementType: Cl F O O N C C C C C C C C C C C C C C C
charge: -0.062935 -0.202743 -0.082696 -0.249737 -0.126497 -0.059753 0.224347 0.234311 0.223675 0.188622 -0.198521 -0.162211 -0.271185 -0.103688 0.686555 -0.437343 0.352219 -0.125272 0.217869 -0.045017
polarizability: 3.33549743e+02 5.30688865e+00 1.98614940e+02 -9.06073821e-01 4.09770287e+00 8.35058002e+01
1716.lowfreq: -76.8614 -6.3512 -3.9317 0.0011 0.0019 0.0022 3.0421 32.8096 58.8770
frequency: -76.8598 32.8033 58.8758 70.3113 88.8065 95.7162 123.3585 145.9411 161.2724 188.4837 217.5924 246.1106 262.7808 289.5922 294.5591 348.1495 372.5015 389.4699 401.9362 423.5684 440.9084 468.1468 472.9980 518.7130 550.8669 573.0808 579.2349 612.5760 629.9557 636.8291 685.2055 707.7809 716.2738 730.0223 753.6308 774.2029 792.1532 825.6600 874.4563 887.2276 905.2049 931.5456 947.2383 947.8001 958.4435 978.3165 1006.1433 1008.2167 1032.1985 1096.2249 1127.6596 1139.7104 1184.9812 1194.8624 1205.7205 1217.6667 1229.7714 1240.3721 1265.5323 1310.1033 1352.3891 1355.2271 1377.9959 1378.6782 1431.2651 1435.1348 1445.6319 1453.3986 1466.7077 1486.9861 1503.5613 1584.9034 1600.9732 1619.3541 1623.5114 1636.2924 2990.1990 3024.9239 3075.2843 3138.4888 3143.8576 3164.5845 3172.7042 3178.5957 3182.0696 3482.1739 3547.1652
redmass: 1.0358 6.7445 6.2254 6.8154 5.8213 5.9573 4.8164 8.3514 5.5396 5.7001 9.4834 5.3837 6.1183 6.7443 7.3171 1.7612 2.7422 4.1961 5.2702 4.7167 3.7861 3.9845 5.3624 5.4621 5.1634 4.2174 3.3082 5.3361 5.7325 4.7102 1.9947 2.6271 4.3532 4.2813 4.4245 4.3649 4.1599 1.4556 1.5326 1.6598 3.7138 5.0895 1.7390 1.5407 1.6596 4.0371 1.8721 7.8611 1.6664 1.8470 1.5472 2.2009 2.3689 1.5661 1.2907 4.0893 1.8606 1.7698 1.4467 4.0167 2.5414 1.4966 2.0185 2.0542 3.2825 6.1123 1.8247 1.7594 1.0465 5.0539 2.0792 6.5470 7.8271 7.6146 7.8437 5.0143 1.0384 1.0832 1.0983 1.0981 1.0902 1.0930 1.0934 1.0957 1.0934 1.0763 1.0663
irintensity: 0.1367 0.0238 4.3272 6.7825 0.6909 1.4606 0.7276 3.2986 0.5217 0.9133 0.0033 0.1006 2.5534 3.2311 1.6170 57.6311 48.6825 4.6513 10.9912 3.3884 15.0532 23.0485 22.0264 2.6134 8.4605 9.9502 1.5498 3.2006 12.8183 3.6637 21.6781 43.3709 16.6802 10.3946 14.3608 20.1365 32.3618 46.0373 19.1236 25.6216 19.1864 8.4202 15.2408 7.8065 15.4953 75.4486 26.7298 30.5062 8.5147 12.1017 16.9111 10.5321 49.4291 1.8371 22.4973 13.5886 80.6816 121.9234 3.4226 33.7311 61.6008 101.1437 50.0244 21.3087 74.4629 109.2879 57.8101 166.3639 20.3690 11.8641 481.2414 84.8998 11.5554 10.7222 61.4609 89.6986 6.5165 6.4206 12.9959 6.9637 7.3786 0.8408 1.0997 6.4423 13.4596 44.7384 9.9721
temp: 298.150 k
press: 1.00000 atm
elementType: 17 9 8 8 7 6 6 6 6 6 6 6 6 6 6 6 6 6 6 6 1 1 1 1 1 1 1 1 1 1 1
symmnumber: 1
zpe: 587495.2 jmol-1
zpe.correction: 0.223765 hartree
zpe.thermalcorrener: 0.240582 hartree
zpe.thermalcorrenthalpy: 0.241526 hartree
zpe.thermalcorrgfe: 0.178535 hartree
zpe.sumelectzpe: -1341.926866 hartree
zpe.sumelectthermal: -1341.910049 hartree
zpe.sumelectthermalent: -1341.909105 hartree
zpe.sumelectthermalfe: -1341.972096 hartree
dipole: -2.6392 3.8699 0.5540
dipole: 4.7169
quadrupole: -115.6735 -129.9284 -120.7230
quadrupole: -0.9287 -0.2819 0.0220
quadrupole: 6.4348 -7.8201 1.3853 -0.9287 -0.2819 0.0220
hfenergy: -1342.1506313 hartree
pointgroup: C01 [X(C15H11Cl1F1N1O2)]
dipole: 0.9391837 1.5755777 -0.2816168 debye
polarizability: 333.6753099|3.3947431|197.9389284|0.0036154|-8.9599563|84.0562444 unknown
InChI: InChI=1S/C15H11ClFNO2/c1-7(19)18-14-6-12-10(5-13(14)16)9-3-2-8(17)4-11(9)15(12)20/h2-6,15,18,20H,1H3
charge 0 multiplicity 1
31 atoms
Cl 2.892215 3.113727 -0.244366
F  -5.902402 -0.616748 0.053902
O  -0.866128 -2.75718 -0.605898
O  4.137454 -2.056476 0.284067
N  3.811189 0.256981 0.025968
C  -0.95439 -1.619278 0.323524
C  0.150992 -0.569056 0.175415
C  -0.423851 0.728511 0.045381
C  -2.226651 -0.777271 0.185783
C  -1.895779 0.604883 0.050665
C  1.534922 -0.773262 0.174834
C  0.411577 1.856905 -0.079843
C  -3.560144 -1.212226 0.189406
C  -2.913424 1.575212 -0.069095
C  2.40051 0.355552 0.041481
C  1.79953 1.643597 -0.078302
C  -4.550005 -0.216908 0.058455
C  -4.264912 1.156542 -0.064809
C  4.607007 -0.891369 0.144366
C  6.105262 -0.600976 0.086872
H  -0.906503 -2.11137 1.312573
H  1.977387 -1.767049 0.268188
H  0.01326 2.87045 -0.17691
H  -3.831935 -2.267424 0.280517
H  -2.676508 2.639662 -0.167392
H  -5.087716 1.870969 -0.157869
H  -0.860245 -2.407992 -1.534314
H  4.303203 1.150343 -0.080987
H  6.385559 -0.123622 -0.870237
H  6.649539 -1.551093 0.181786
H  6.415487 0.071062 0.908238
