program: Gaussian 09
title: 000251975
version: EM64L-G09RevD.01
frameworkgroup: C1[X(C13H10ClNO)]
method: RPBEPBE
basis: SDD
operation: Freq
keyword: #p
keyword: freq=noraman
keyword: PBEPBE/SDD
title: #p freq=noraman PBEPBE/SDD
converged: NO YES NO NO
title: Mulliken charges:
elementType: Cl O N C C C C C C C C C C C C C H H H H H H H H H H
charge: -0.074049 -0.434494 -0.701691 -0.335104 0.251144 0.191685 0.163164 0.221311 -0.621594 -0.366356 -0.391511 -0.379742 0.546480 -0.444843 -0.238517 -0.087862 0.250470 0.252588 0.237558 0.261534 0.264433 0.219634 0.255159 0.339548 0.312037 0.309018
chargesum: 0.00000
title: Mulliken charges with hydrogens summed into heavy atoms:
elementType: Cl O N C C C C C C C C C C C C C
charge: -0.074049 -0.094946 -0.080636 -0.084634 0.251144 0.191685 0.163164 0.221311 -0.369006 -0.128798 -0.129977 -0.115309 0.546480 -0.225209 0.016642 -0.087862
polarizability: 2.87958805e+02 9.47746116e+00 1.65984322e+02 -8.75729228e-02 -6.06697903e+00 6.98813912e+01
1716.lowfreq: -3.7947 -0.0006 0.0005 0.0011 4.8963 6.0633 59.6104 81.8663 120.4067
frequency: 59.6078 81.8655 120.4045 129.6816 164.0847 192.4088 248.5560 271.5919 309.3026 338.2444 348.3530 371.5333 382.9607 386.1349 408.4075 427.8655 446.2842 471.2095 549.0659 554.1510 576.2279 600.6390 637.7621 674.0198 718.2940 733.1939 763.7773 782.7285 810.5423 821.8193 836.9760 877.7770 880.0878 927.7810 945.6567 950.0985 967.7722 1006.2796 1034.2511 1058.3143 1108.3103 1124.8863 1156.8323 1179.6644 1198.4680 1203.2027 1228.3039 1264.0268 1290.1837 1328.5579 1354.5127 1373.4718 1394.2530 1409.4736 1458.0102 1473.1709 1499.9136 1580.5091 1593.3202 1609.2137 1637.8341 1645.8583 3024.3881 3120.2376 3129.4476 3144.7432 3144.9114 3162.3806 3175.9754 3546.0424 3565.1019 3705.4392
redmass: 5.5384 6.2228 5.6499 5.3333 4.6096 5.0353 5.6344 5.0854 7.4334 4.2843 1.7990 1.9088 1.0669 1.2444 3.2206 4.7465 3.3211 4.2959 5.4680 4.5050 5.7928 3.7203 6.2833 4.0037 5.2186 4.6323 4.4426 3.3525 1.8622 1.5259 2.9125 1.5325 1.6244 3.3180 1.3755 1.3681 4.8570 4.5252 1.5143 2.1969 1.8162 1.8971 1.3914 2.0696 1.6132 1.2667 1.7782 1.3798 1.9609 2.6148 1.1741 8.2566 3.5391 3.7204 3.1865 5.3729 4.4365 8.2524 6.9552 7.7786 2.3534 1.7481 1.0835 1.0872 1.0918 1.0928 1.0939 1.0928 1.0956 1.0662 1.0449 1.1040
irintensity: 1.7163 1.6460 0.5243 0.4758 0.2756 0.7581 2.6966 4.1728 0.9680 3.0688 46.0132 61.7642 13.2060 297.3328 1.4147 14.1215 3.4536 7.9033 2.1100 11.4671 11.6839 13.6115 4.8584 14.4039 2.5668 2.0850 12.3195 46.3049 58.0845 37.9961 26.8734 19.1798 23.3305 18.4648 0.0608 0.7232 65.6443 35.7453 0.7755 30.6232 12.1390 2.9253 14.8919 16.3255 0.9561 26.3585 11.8853 0.2698 8.6553 71.3608 36.7460 19.7819 16.3547 18.4619 128.9024 36.0928 80.0282 57.6560 1.7978 180.9535 10.6720 369.0738 10.6491 15.4238 16.7438 23.4420 3.4232 2.4028 2.4966 8.1344 123.1937 22.2171
temp: 298.150 k
press: 1.00000 atm
elementType: 17 8 7 6 6 6 6 6 6 6 6 6 6 6 6 6 1 1 1 1 1 1 1 1 1 1
symmnumber: 1
zpe: 512578.0 jmol-1
zpe.correction: 0.195231 hartree
zpe.thermalcorrener: 0.208588 hartree
zpe.thermalcorrenthalpy: 0.209532 hartree
zpe.thermalcorrgfe: 0.155465 hartree
zpe.sumelectzpe: -1090.325161 hartree
zpe.sumelectthermal: -1090.311804 hartree
zpe.sumelectthermalent: -1090.310860 hartree
zpe.sumelectthermalfe: -1090.364927 hartree
dipole: -4.9151 -0.9666 0.3407
dipole: 5.0208
quadrupole: -80.3763 -96.4436 -101.8453
quadrupole: 11.0194 -0.6718 -1.3473
quadrupole: 12.5121 -3.5552 -8.9569 11.0194 -0.6718 -1.3473
hfenergy: -1090.5203918 hartree
pointgroup: C01 [X(C13H10Cl1N1O1)]
dipole: -1.9636183 0.165306 -0.1370917 debye
dipolederiv: -0.7081026 -0.329245 0.0521647 -0.4478457 -0.3938302 0.047824 0.0813518 0.0531484 -0.092208 -0.5859786 -0.0155218 -0.0421016 -0.0004845 -0.6580316 -0.237787 -0.0607734 -0.3515593 -0.3222691 -1.9977127 0.0152203 -0.0078784 -0.1014389 -0.1048848 -0.1014831 -0.0194485 -0.0982214 -0.7235297 0.4667864 0.0346788 0.0213553 0.0247532 0.5475785 0.1566321 0.038784 0.2564825 0.4463381 0.2202247 0.1675837 -0.0114577 0.0990406 0.0416452 -0.067184 -0.0011883 -0.0482227 -0.0785866 -0.408733 0.0227595 -0.0296925 0.416658 -0.1550242 -0.044305 -0.0802138 -0.033419 -0.1271352 -0.5264605 -0.0514836 0.0111889 0.0823241 -0.256673 0.0235183 -0.0346363 0.0209556 -0.0464418 0.9660756 -0.0194122 -0.0069946 -0.1587148 0.0423934 -0.0082268 0.0285368 -0.0126019 0.0369042 -0.5141357 -0.035898 0.0041076 0.5090884 0.0166277 -0.0378304 -0.0977759 -0.0292195 -0.2160148 0.4571195 -0.1300445 0.0311569 -0.1362153 0.1618525 -0.0464254 0.040905 -0.0385752 -0.1031479 0.345316 -0.0088813 -0.0014177 -0.0975049 0.1232265 -0.0413296 0.0163423 -0.0277827 -0.121948 -0.6159403 -0.0937927 0.0082363 -0.2644021 -0.0616897 -0.0114421 0.0457583 -0.0016792 -0.1326596 1.9912432 -0.0102946 0.0247473 0.2167148 0.0096402 0.0283285 0.0206759 0.0276457 0.1464075 -0.6257174 0.0813577 -0.0126632 -0.6265314 0.0442948 -0.0547396 0.0877777 -0.0436946 -0.2266711 -0.4521906 -0.1025042 0.0111964 -0.2539879 -0.224999 0.0138471 0.0446511 0.0180499 -0.153056 1.0506677 0.4676715 -0.0819857 0.7112037 0.5513165 -0.0961105 -0.1310311 -0.09872 -0.0293095 -0.0003111 -0.0118676 0.0143755 -0.009943 -0.0260993 0.0720762 0.0109791 0.0229237 -0.048681 0.0045583 -0.0679216 0.0069831 -0.098226 -0.0284939 0.0322534 0.008152 0.0281629 0.1598648 0.0626435 -0.0983498 0.0132739 -0.0616394 -0.0558347 0.0280092 0.006366 0.0301199 0.141151 0.0754909 0.0005779 0.0036213 0.0459935 -0.0640661 0.0343951 -0.0028376 0.0317193 0.1465462 0.0971763 0.0375864 -0.0046825 0.0187768 -0.0337591 0.0271544 0.0000959 0.0289489 0.1585978 -0.0498755 0.1152896 -0.020534 0.1089874 -0.0464322 0.0335996 -0.022727 0.0356124 0.1626984 -0.0470207 0.044664 -0.0024626 0.0320754 0.0888728 0.0104161 0.0017345 0.0072346 0.1710675 0.318362 -0.0133532 0.0292397 -0.0216895 0.2374013 0.157322 0.0248373 0.1429412 0.0935098 0.2364003 0.0151679 -0.0075559 0.076079 0.1194693 0.0414609 -0.0131785 0.0411046 0.3780676 0.2401145 -0.013987 -0.0022204 -0.0630716 0.1254992 0.0400266 0.0068628 0.0386458 0.3805053 unknown
polarizability: 288.5886182|3.5606974|164.2992327|-0.2690957|-11.6750315|70.9366678 unknown
InChI: InChI=1S/C13H10ClNO/c14-7-1-3-10-11(5-7)9-4-2-8(15)6-12(9)13(10)16/h1-6,13,16H,15H2
charge 0 multiplicity 1
26 atoms
Cl 4.680481 1.836742 -0.226427
O  -0.382449 -2.95031 -0.45448
N  -4.810646 0.334443 -0.005258
C  -0.214358 -1.785859 0.439674
C  -1.243347 -0.669574 0.233972
C  1.114052 -1.043241 0.280579
C  -0.581795 0.581145 0.04758
C  0.875271 0.350791 0.076069
C  -2.636626 -0.774831 0.220931
C  -1.349478 1.749712 -0.144316
C  2.418357 -1.555565 0.323881
C  1.956773 1.246324 -0.076182
C  -3.418251 0.405876 0.018097
C  -2.756208 1.660666 -0.157606
C  3.517203 -0.670317 0.162577
C  3.256849 0.702342 -0.027816
H  -0.306338 -2.240977 1.443171
H  -3.123731 -1.747975 0.355021
H  -0.86967 2.724816 -0.285597
H  2.594092 -2.62626 0.471991
H  1.806658 2.318816 -0.228577
H  -3.358144 2.565139 -0.308324
H  4.546679 -1.03742 0.186348
H  -0.303993 -2.633025 -1.391157
H  -5.289078 -0.55249 0.121662
H  -5.3735 1.167933 -0.147008
