program: Gaussian 09
title: 000251974
version: EM64L-G09RevD.01
frameworkgroup: C1[X(C13H8ClNO)]
method: RPBEPBE
basis: SDD
operation: Freq
keyword: #p
keyword: freq=noraman
keyword: PBEPBE/SDD
title: #p freq=noraman PBEPBE/SDD
converged: YES YES NO NO
title: Mulliken charges:
elementType: Cl O N C C C C C C C C C C C C C H H H H H H H H
charge: -0.054768 -0.158038 -0.696066 0.266977 0.316485 0.241339 0.219991 -0.313650 -0.371004 -0.627688 -0.378549 -0.407953 0.544202 -0.435865 -0.089315 -0.237279 0.242595 0.274005 0.269605 0.281564 0.223031 0.261247 0.317233 0.311900
chargesum: 0.00000
title: Mulliken charges with hydrogens summed into heavy atoms:
elementType: Cl O N C C C C C C C C C C C C C
charge: -0.054768 -0.158038 -0.066932 0.266977 0.316485 0.241339 0.219991 -0.313650 -0.128409 -0.353683 -0.108943 -0.126389 0.544202 -0.212834 -0.089315 0.023969
polarizability: 3.05934549e+02 -5.52618980e+00 1.75005675e+02 1.85916740e-03 1.34144740e-03 5.90927471e+01
1716.lowfreq: -4.7678 -3.2896 -2.1908 -0.0024 -0.0008 0.0004 61.1285 95.4988 123.3954
frequency: 61.1261 95.4975 123.3953 140.7599 176.1459 232.4309 251.0858 273.4983 314.6204 332.7641 374.9364 387.2764 407.4540 418.6188 434.0791 440.8200 515.8811 541.1149 573.3300 594.0628 596.5511 657.4853 680.7510 726.1973 755.2357 767.2526 800.0380 828.5097 841.9533 846.2196 886.1806 912.3808 950.1515 951.8930 969.5366 1012.4243 1037.1663 1054.2855 1080.7546 1109.8045 1149.0856 1184.3747 1219.4732 1260.9260 1279.4370 1324.9099 1365.0934 1396.6935 1407.4204 1448.0533 1477.4089 1500.4887 1582.5788 1591.6466 1602.6823 1627.2232 1639.6976 1647.7187 3122.4221 3135.3340 3146.4020 3151.8925 3163.8392 3179.2370 3561.9132 3701.6802
redmass: 6.0359 6.5526 8.0406 4.8567 5.1232 7.7907 6.1724 10.8186 6.7176 4.5023 3.6694 1.0580 1.2478 2.8769 6.6487 2.9768 6.2453 5.7185 6.0207 8.3652 3.3853 7.6174 3.5520 6.4728 6.7802 3.4337 1.9511 1.5509 7.0044 1.8750 1.5548 1.9122 1.4030 3.3607 1.4482 2.9993 1.6762 2.4505 2.6599 1.8178 1.4816 2.3511 1.9404 1.3446 1.9844 2.3834 9.2370 3.0564 3.8031 2.9467 6.4881 4.3194 8.0701 7.7820 8.1768 7.2184 2.8277 1.6782 1.0876 1.0923 1.0965 1.0903 1.0930 1.0959 1.0451 1.1041
irintensity: 1.2981 5.2287 0.8365 0.1129 0.2425 5.1323 1.0543 0.0043 1.2140 1.5723 3.7067 3.5377 323.8472 0.1265 16.1971 1.4331 1.1305 1.5552 0.9372 9.8424 15.7551 2.3862 1.8358 3.7990 6.0352 0.0195 52.1928 44.2386 77.9481 6.1738 11.8503 30.8981 0.1182 30.0491 3.4516 18.9602 0.2429 44.9408 2.1876 24.2438 27.9747 16.9231 16.7087 3.6559 10.9636 96.6013 5.6830 26.8656 17.9889 70.2602 75.9206 173.3150 200.4323 123.9135 187.2999 110.7457 29.9557 293.1444 15.5607 10.5486 19.5566 2.6075 1.8262 1.6085 139.6880 24.3506
temp: 298.150 k
press: 1.00000 atm
elementType: 17 8 7 6 6 6 6 6 6 6 6 6 6 6 6 6 1 1 1 1 1 1 1 1
symmnumber: 1
zpe: 454708.4 jmol-1
zpe.correction: 0.173189 hartree
zpe.thermalcorrener: 0.185819 hartree
zpe.thermalcorrenthalpy: 0.186763 hartree
zpe.thermalcorrgfe: 0.134110 hartree
zpe.sumelectzpe: -1089.160023 hartree
zpe.sumelectthermal: -1089.147393 hartree
zpe.sumelectthermalent: -1089.146449 hartree
zpe.sumelectthermalfe: -1089.199102 hartree
dipole: 4.2872 -3.0581 0.0010
dipole: 5.2661
quadrupole: -71.4117 -98.7670 -103.8106
quadrupole: -13.2381 0.0052 -0.0010
quadrupole: 19.9181 -7.4373 -12.4808 -13.2381 0.0052 -0.0010
hfenergy: -1089.333212 hartree
pointgroup: C01 [X(C13H8Cl1N1O1)]
dipole: 1.7927501 1.0385451 0.0011423 debye
dipolederiv: -0.7620565 0.3574425 -0.000761 0.4887211 -0.3999453 0.0005534 -0.0008297 0.0004378 -0.069909 -0.5409578 0.1166497 -0.0002638 0.1155095 -1.1028854 0.0003031 -0.0002244 0.0001942 -0.3027565 -1.9955876 -0.004415 -0.0011546 0.0677098 -0.0788835 -0.0001129 0.0001562 -0.0001409 -0.733765 -0.596469 0.0893334 -0.0004613 -0.0704201 -0.1649407 -0.0000342 -0.0004286 0.0001517 -0.0643475 1.0874482 -0.0415982 0.0010226 0.0192669 0.1365583 0.0000082 0.0009583 -0.0001158 0.0293319 -0.1887923 -0.4286097 -0.000195 -0.3398134 -0.1989437 -0.0002766 -0.0001492 -0.0004009 0.0572156 -0.9073898 0.2276782 -0.0009689 -0.1660666 -0.2891333 -0.0001321 -0.0008929 0.000292 0.0122643 1.3104866 -0.102622 0.0012384 -0.0744851 1.3113408 -0.0003278 0.0011003 -0.0002241 0.1072759 0.3721342 0.0281024 0.0004686 0.0898891 0.1511319 -0.0000371 0.0005631 -0.0000078 -0.1058216 -0.3910094 0.1354816 -0.0000934 -0.5456446 0.076557 -0.0005346 0.0000461 0.0000654 -0.189909 -0.8966234 0.1612362 -0.0007936 0.260679 -0.037309 0.0002448 -0.0008157 0.0001322 -0.1313919 0.4534438 -0.1066311 0.0005727 0.1125407 0.1623354 0.000092 0.0005338 -0.0001625 -0.1038975 2.0358334 0.0099968 0.0011986 -0.1059702 -0.0707417 -0.0000135 0.0001008 0.0000747 0.1465654 -0.5445592 -0.0363017 -0.0001907 0.5969594 0.0595173 0.0004646 -0.0003313 -0.0001148 -0.2240578 1.2676777 -0.5076855 0.0014217 -0.631547 0.6039542 -0.0007657 0.0014886 -0.0006385 -0.0345483 -0.3878403 0.1353789 -0.0002477 0.2590898 -0.3274686 0.0003035 -0.0002506 0.0002006 -0.1529455 0.0635899 0.0976184 -0.0001108 0.056538 -0.0521404 0.0001142 -0.0001933 0.0001097 0.1466089 0.0228815 0.0490824 -0.0001634 0.0852714 -0.0044893 0.0001079 -0.0001085 0.0000316 0.1700045 0.0926286 -0.0345833 -0.0000719 -0.0165089 -0.0303697 0.0000218 -0.000088 0.0000203 0.1638717 0.0843769 0.0121677 -0.000074 -0.0427388 -0.0311237 -0.0000173 -0.0000713 0.0000461 0.1593105 -0.0425804 -0.1137266 -0.0001934 -0.1106452 -0.0432801 -0.0000537 -0.0001196 -0.000026 0.1682214 -0.0380672 -0.0401932 -0.0002169 -0.0291375 0.0888161 -0.0000195 -0.0002253 -0.0000443 0.1754149 0.2527101 -0.0207509 0.0000267 -0.0918058 0.1207889 0.0000201 -0.0000854 0.0000777 0.3886036 0.2487222 0.0169488 0.0000112 0.0726084 0.1206542 0.0000914 -0.0001334 0.0000416 0.3886611 unknown
polarizability: 305.8062942|-6.8763588|175.1336968|0.237756|-0.0284148|59.0929803 unknown
InChI: InChI=1S/C13H8ClNO/c14-7-1-3-10-11(5-7)9-4-2-8(15)6-12(9)13(10)16/h1-6H,15H2
charge 0 multiplicity 1
24 atoms
Cl -4.680187 1.845027 -0.005178
O  0.447238 -2.971238 0.000818
N  4.833839 0.391445 0.003713
C  0.599976 0.636987 0.000379
C  -0.861457 0.39256 -0.000909
C  1.26808 -0.624653 0.001287
C  -1.088832 -1.020776 -0.001043
C  0.236879 -1.72619 0.000485
C  1.366178 1.816399 0.000855
C  2.65951 -0.736725 0.002822
C  -1.952005 1.281552 -0.002238
C  -2.38369 -1.559233 -0.002274
C  3.443144 0.461815 0.003558
C  2.777344 1.726212 0.002375
C  -3.248725 0.714039 -0.003462
C  -3.493495 -0.675503 -0.003493
H  0.891802 2.804076 0.000088
H  3.132877 -1.725506 0.003409
H  -1.82256 2.367339 -0.00238
H  -2.531984 -2.643903 -0.002268
H  3.378029 2.643883 0.002685
H  -4.519193 -1.053035 -0.00452
H  5.309758 -0.506268 0.004191
H  5.400775 1.234594 0.0038
