program: Gaussian 09
title: 000019526
version: EM64L-G09RevD.01
frameworkgroup: C1[X(C4H9NS2)]
method: RPBEPBE
basis: SDD
operation: Freq
keyword: #pfreq=noraman
keyword: PBEPBE/SDD
title: #p freq=noraman PBEPBE/SDD
converged: YES YES NO NO
title: Mulliken charges:
elementType: S S N C C C C H H H H H H H H H
charge: 0.188135 -0.002639 0.005645 -0.615081 -0.626027 -0.447828 -0.811373 0.272750 0.235391 0.234088 0.234356 0.259887 0.259176 0.240949 0.285959 0.286610
chargesum: 0.00000
title: Mulliken charges with hydrogens summed into heavy atoms:
elementType: S S N C C C C
charge: 0.188135 -0.002639 0.005645 0.127148 0.127393 -0.447828 0.002145
polarizability: 1.11100488e+02 3.29675909e+00 9.93428101e+01 1.18158220e-02 2.29423461e-01 4.65841581e+01
1716.lowfreq: -9.0211 -0.0023 -0.0019 -0.0012 5.6356 15.1795 57.3886 82.0987 85.2859
frequency: 57.3360 82.0961 85.2858 112.0099 119.0720 209.1156 249.1340 269.6604 328.0848 386.6565 420.6470 530.7419 537.3405 675.9824 851.7361 951.2475 985.2879 989.2459 1051.0233 1084.3343 1133.5588 1135.9582 1243.2021 1340.8725 1378.1781 1421.4441 1426.0928 1444.6606 1453.4064 1465.7462 1476.9230 1484.9146 1500.5675 2971.9440 2978.8871 3015.9807 3057.5600 3057.8154 3110.3686 3112.7133 3142.0274 3152.5649
redmass: 1.4268 2.2713 1.3571 1.0526 1.7349 3.4990 2.8056 4.7535 5.5420 4.9805 3.5441 9.8395 4.6039 7.5887 5.2058 4.7457 1.1804 1.2992 1.5179 1.2240 1.4716 1.7275 4.1645 1.1506 2.2008 1.1422 1.0510 1.0564 1.1392 1.0423 1.0790 1.0444 1.4271 1.0342 1.0357 1.0284 1.1021 1.1017 1.0989 1.0991 1.1033 1.1056
irintensity: 0.3744 4.2950 3.5822 0.0233 0.2477 3.5877 6.7246 3.2106 0.0877 21.8404 5.6315 0.0345 1.8128 2.5136 16.5874 120.4867 6.8392 8.7967 19.7270 0.3832 26.3498 78.7575 45.3152 11.5370 83.4013 29.0813 15.6147 32.1448 3.1700 23.6944 12.1851 8.6829 143.8756 50.4569 48.6115 21.2966 10.9373 39.4835 13.5576 7.1235 6.3977 8.5662
temp: 298.150 k
press: 1.00000 atm
elementType: 16 16 7 6 6 6 6 1 1 1 1 1 1 1 1 1
symmnumber: 1
zpe: 331852.6 jmol-1
zpe.correction: 0.126396 hartree
zpe.thermalcorrener: 0.136372 hartree
zpe.thermalcorrenthalpy: 0.137316 hartree
zpe.thermalcorrgfe: 0.090219 hartree
zpe.sumelectzpe: -1008.120486 hartree
zpe.sumelectthermal: -1008.110510 hartree
zpe.sumelectthermalent: -1008.109566 hartree
zpe.sumelectthermalfe: -1008.156663 hartree
dipole: -2.0164 -2.7396 0.0083
dipole: 3.4017
quadrupole: -45.2521 -62.0898 -59.8591
quadrupole: 1.2260 0.0257 -0.0560
quadrupole: 10.4815 -6.3561 -4.1254 1.2260 0.0257 -0.0560
hfenergy: -1008.2468818 hartree
pointgroup: C01 [X(C4H9N1S2)]
dipole: 0.7000464 -1.0117699 -0.5266357 debye
dipolederiv: -0.4941952 -0.2798466 -0.0540206 -0.4911028 -0.4046825 -0.0607418 -0.1382523 -0.0935988 -0.0967321 -0.3968723 0.0292147 0.0390284 0.0213901 -0.842378 -0.2610602 0.0363743 -0.2637639 -0.3300255 -1.1834357 0.2929788 0.2717629 0.1039215 -0.6051551 -0.1792418 0.1946907 -0.2223023 -0.3135148 0.3455473 0.0634458 0.0085647 0.328665 0.0527355 -0.133579 0.1219373 -0.0949102 0.1850748 0.0651405 -0.0121687 0.0162166 -0.1510915 0.347884 0.062935 -0.0419948 0.0473715 0.2451796 1.3378634 -0.1115901 -0.2731634 0.1412885 1.1353629 0.5077472 -0.1697231 0.5488184 0.0957534 0.1689453 0.014128 -0.0100254 -0.0085246 0.0295817 -0.0081206 -0.0207716 -0.0117515 0.0466092 0.2153841 0.081921 0.0262327 -0.0679411 -0.0025157 -0.0494363 -0.0392978 -0.0681988 0.1003285 -0.0485228 -0.0325553 0.0654661 -0.0584095 0.1159995 0.0226035 0.1243608 0.0517906 -0.1113406 -0.1088324 0.039259 -0.06163 0.0758798 0.0390972 0.1077592 -0.1115943 0.0802149 0.0306474 -0.1278513 0.0664181 0.0779897 -0.0192769 0.0913432 -0.0061187 0.0408216 -0.0231231 0.1049265 0.0644486 -0.0391033 -0.1259175 0.0373287 0.0225619 -0.0194645 -0.0672432 -0.0378353 -0.0436068 0.1098319 -0.0682785 0.030115 0.0189855 -0.0698325 0.0331961 0.0365625 0.0865551 -0.0190957 -0.0544208 -0.0770926 -0.0022374 -0.1357311 0.0260096 -0.0214928 -0.026791 -0.0305747 0.1252514 0.0551054 0.017357 0.0128 0.1102373 -0.0173767 0.0767358 0.0434526 0.0459395 0.0344812 0.0518639 0.0159127 -0.0211816 0.0943812 0.0813649 -0.0717214 0.0174682 -0.0146315 -0.0539363 unknown
polarizability: 109.3267665|-0.5378113|92.0577613|-9.5804787|18.6678945|55.6429288 unknown
InChI: InChI=1S/C4H9NS2/c1-5(2)4(6)7-3/h1-3H3
charge 0 multiplicity 1
16 atoms
S  -1.381347 -1.254542 0.193249
S  -0.336189 1.525632 1.177777
N  1.201199 -0.4905 0.1136
C  2.427831 0.316636 0.275977
C  1.375894 -1.836736 -0.475659
C  -0.029631 -0.01193 0.497552
C  -2.872963 -0.300031 0.798759
H  2.164233 1.273063 0.751749
H  2.887752 0.514391 -0.71052
H  3.154209 -0.222149 0.912659
H  2.434786 -1.968853 -0.746064
H  0.760544 -1.953915 -1.386697
H  1.090676 -2.628252 0.242456
H  -3.72636 -0.983101 0.658397
H  -2.991687 0.616772 0.204367
H  -2.738647 -0.038485 1.857798
