program: Gaussian 09
title: 000251946
version: EM64L-G09RevD.01
frameworkgroup: C1[X(C11H12Cl3NO)]
method: RPBEPBE
basis: SDD
operation: Freq
keyword: #p
keyword: freq=noraman
keyword: PBEPBE/SDD
title: #p freq=noraman PBEPBE/SDD
converged: YES YES NO NO
title: Mulliken charges:
elementType: Cl Cl Cl O N C C C C C C C C C C C H H H H H H H H H H H H
charge: -0.054634 -0.054594 -0.054007 -0.223216 -0.128363 -0.418093 -0.424544 0.489026 -0.557121 -0.556272 -0.316972 -0.363380 -0.325322 -0.387084 0.459644 -0.210549 0.242974 0.279204 0.243964 0.280400 0.270309 0.291136 0.270892 0.292111 0.255871 0.232443 0.275939 0.190238
chargesum: 0.00000
title: Mulliken charges with hydrogens summed into heavy atoms:
elementType: Cl Cl Cl O N C C C C C C C C C C C
charge: -0.054634 -0.054594 -0.054007 -0.223216 -0.128363 0.104086 0.099820 0.489026 0.004324 0.006731 -0.061101 -0.130937 -0.325322 -0.111145 0.459644 -0.020311
polarizability: 2.47676301e+02 7.70919902e+00 1.34493975e+02 3.40243835e+00 2.95189872e+01 1.25309849e+02
1716.lowfreq: -2.0062 -0.0027 -0.0016 0.0009 4.5286 8.7562 27.1695 31.9672 49.4128
frequency: 27.0897 31.9118 49.3700 72.0717 85.4542 90.7328 128.8549 159.4842 162.7254 171.7063 189.0029 210.0531 249.2682 318.2629 336.1787 363.7853 380.1828 401.8866 453.0344 455.1742 510.0801 540.9134 594.2413 602.2284 605.5961 613.3486 661.0959 716.1334 727.7653 819.3833 823.4856 841.3622 870.7936 890.5549 918.5261 953.5666 965.5861 997.6697 1007.0425 1012.2301 1031.5688 1050.7349 1147.1643 1163.8772 1177.3576 1178.7325 1235.1549 1241.6553 1257.7101 1275.1803 1300.0306 1306.9569 1347.4714 1355.5045 1359.9611 1381.3881 1394.1644 1438.6917 1441.4663 1443.6283 1471.3175 1489.3144 1517.5083 1529.8395 1585.1554 1628.3194 2942.1729 2987.0167 2989.8652 3058.3670 3058.5664 3079.9397 3086.1418 3139.7125 3145.2421 3145.9556 3173.2077 3185.5098
redmass: 14.5225 13.7831 14.0695 7.7769 6.2314 5.3802 3.2971 3.7642 5.6206 5.3706 5.0365 5.7671 5.7848 3.9792 4.1541 3.8602 3.3962 5.4820 2.9486 2.9545 2.3459 3.2676 5.2457 4.8921 4.3875 4.0162 6.3786 2.8253 4.6451 1.5758 2.8989 1.6670 1.8284 2.7847 1.8660 2.1911 1.5161 1.5455 1.8592 3.2779 2.6625 1.8186 1.6125 1.2058 1.8545 1.3363 1.3099 1.9566 1.4409 1.7601 1.2277 1.1833 1.5648 1.5649 1.6791 1.5711 1.8444 2.0941 1.1096 1.4450 1.1482 1.3871 2.2283 7.3196 6.0217 7.2234 1.0861 1.0683 1.0684 1.0582 1.0579 1.0942 1.0936 1.0893 1.1105 1.1103 1.0935 1.0908
irintensity: 0.8794 1.0311 0.5569 7.2513 0.3124 3.5331 6.9282 4.7671 4.5471 1.7487 2.2021 2.8369 4.0487 1.6939 3.0874 5.6988 4.2929 11.6912 21.1208 5.8057 3.1396 15.3823 17.2435 5.7870 6.1406 15.9382 10.3828 0.9595 25.9024 21.0112 15.0084 40.5794 0.6675 37.2179 67.0920 11.0213 0.3423 5.6156 3.7823 78.2156 8.7455 4.4286 23.0209 21.5068 31.6090 4.5642 82.3908 71.2200 3.6672 117.0190 5.3444 23.8162 60.9119 179.7339 3.9714 51.7123 1.2826 20.5096 0.7495 35.2399 38.0269 27.4408 130.4521 70.2838 560.9892 315.1450 69.0790 28.4599 16.9392 26.2268 2.4588 1.3515 4.6161 0.2344 12.1040 19.3729 15.4916 6.0078
temp: 298.150 k
press: 1.00000 atm
elementType: 17 17 17 8 7 6 6 6 6 6 6 6 6 6 6 6 1 1 1 1 1 1 1 1 1 1 1 1
symmnumber: 1
zpe: 548783.2 jmol-1
zpe.correction: 0.209020 hartree
zpe.thermalcorrener: 0.225434 hartree
zpe.thermalcorrenthalpy: 0.226378 hartree
zpe.thermalcorrgfe: 0.162242 hartree
zpe.sumelectzpe: -1935.323003 hartree
zpe.sumelectthermal: -1935.306589 hartree
zpe.sumelectthermalent: -1935.305645 hartree
zpe.sumelectthermalfe: -1935.369781 hartree
dipole: 4.9604 0.8390 0.5889
dipole: 5.0652
quadrupole: -143.3256 -115.0950 -118.1181
quadrupole: -9.5313 -7.7106 9.6937
quadrupole: -17.8127 10.4179 7.3948 -9.5313 -7.7106 9.6937
hfenergy: -1935.5320231 hartree
pointgroup: C01 [X(C11H12Cl3N1O1)]
dipole: 1.9663076 0.2546891 0.1999799 debye
polarizability: 247.9745731|7.7466625|119.3543215|-0.6008529|27.563939|140.1512301 unknown
InChI: InChI=1S/C11H12Cl3NO/c12-3-5-15(6-4-13)10-2-1-9(8-16)11(14)7-10/h1-2,7-8H,3-6H2
charge 0 multiplicity 1
28 atoms
Cl 3.76015 -2.4317 0.766188
Cl 3.413644 2.786515 -0.745138
Cl -2.866797 1.302001 2.129383
O  -4.632089 -1.102158 -1.185092
N  1.697978 0.038914 -0.051267
C  2.550155 -0.634067 -1.049199
C  2.370081 0.824019 0.999667
C  0.306228 -0.067762 -0.10018
C  2.748457 -2.136421 -0.805519
C  2.36149 2.340906 0.763387
C  -0.519517 0.571244 0.882688
C  -0.356714 -0.81894 -1.131667
C  -1.911129 0.444815 0.819254
C  -1.749183 -0.915348 -1.162567
C  -2.582999 -0.290636 -0.188886
C  -4.050371 -0.437565 -0.278778
H  2.123988 -0.501537 -2.063419
H  3.529496 -0.128952 -1.066704
H  1.900416 0.623702 1.983633
H  3.409806 0.469426 1.087066
H  3.330234 -2.599719 -1.617363
H  1.803917 -2.674707 -0.64354
H  2.819459 2.879273 1.607514
H  1.360892 2.738845 0.542509
H  -0.088143 1.158283 1.695116
H  0.217237 -1.324544 -1.911918
H  -2.257022 -1.486193 -1.94876
H  -4.635767 0.080504 0.514593
