program: Gaussian 09
title: 000251934
version: EM64L-G09RevD.01
frameworkgroup: C1[X(C15H12ClNO)]
method: RPBEPBE
basis: SDD
operation: Freq
keyword: #p
keyword: freq=noraman
keyword: PBEPBE/SDD
title: #p freq=noraman PBEPBE/SDD
converged: YES YES YES YES
title: Mulliken charges:
elementType: Cl O N C C C C C C C C C C C C C C C H H H H H H H H H H H H
charge: -0.073495 -0.258896 -0.450643 -0.693312 0.325112 0.171476 0.274619 0.213505 -0.573936 -0.372886 -0.411940 -0.375028 0.525195 -0.487096 -0.234983 -0.093899 0.212143 -0.799692 0.250972 0.250972 0.321509 0.241005 0.247064 0.263097 0.219554 0.253934 0.311249 0.237151 0.270093 0.237157
chargesum: 0.00000
title: Mulliken charges with hydrogens summed into heavy atoms:
elementType: Cl O N C C C C C C C C C C C C C C C
charge: -0.073495 -0.258896 -0.139393 -0.191368 0.325112 0.171476 0.274619 0.213505 -0.252427 -0.131882 -0.164876 -0.111930 0.525195 -0.267541 0.018951 -0.093899 0.212143 -0.055292
polarizability: 3.43775022e+02 3.95113567e+00 1.83165736e+02 2.80656031e-04 2.42528246e-04 7.72215375e+01
1716.lowfreq: -82.8027 -9.6569 -1.8718 -0.0008 0.0017 0.0024 3.8732 33.1812 61.6132
frequency: -82.7975 33.1718 61.6049 90.0728 96.8171 113.8876 148.9076 177.9136 230.6112 263.4809 270.6746 290.4558 349.2287 351.1895 361.8540 426.5406 438.9776 450.7215 507.4912 529.6624 551.0124 577.3869 598.3411 607.7297 645.2480 648.2779 669.5859 699.3697 750.2590 759.3822 767.9837 808.3843 824.6714 828.4506 882.2251 909.0826 922.6111 932.8363 944.3802 947.9478 976.8571 991.4900 1009.2192 1029.9029 1061.7875 1109.4544 1133.0522 1135.2113 1149.9591 1185.4535 1203.7034 1218.5562 1234.6672 1266.6289 1281.1129 1297.8575 1371.1109 1375.2350 1381.8735 1410.8245 1426.0523 1442.6518 1454.1458 1456.8114 1467.4362 1490.2195 1512.8866 1581.0725 1594.7216 1612.3714 1630.2557 1631.9837 2986.6649 2987.0372 3031.1865 3072.1200 3109.6041 3136.6641 3137.9433 3146.7722 3160.1894 3172.5222 3183.9987 3520.9469
redmass: 1.0449 7.4242 4.8982 6.4074 5.2003 4.0069 8.9462 4.1070 3.1053 4.5234 7.7050 3.3527 6.7560 4.2203 6.3422 2.8098 2.8904 5.0764 4.1435 3.6020 4.5368 3.3291 6.3546 2.9685 6.3251 1.1907 6.9169 2.9446 5.0347 3.5031 5.2812 1.3389 1.5324 5.2649 1.5413 1.5967 4.0956 3.6507 1.3815 1.3588 1.8196 1.9617 3.8432 1.6584 2.2372 2.0141 1.7418 1.1470 1.4638 2.0049 1.7539 2.0379 2.4541 1.4090 1.9577 2.2290 3.7410 1.3720 4.6403 3.7264 1.1801 1.6118 2.5814 2.1598 1.0469 3.7259 2.0569 8.0933 6.3118 7.5991 6.7348 5.1282 1.0611 1.0384 1.0993 1.0984 1.0887 1.0902 1.0978 1.0954 1.0929 1.0953 1.0934 1.0764
irintensity: 0.0315 0.6564 12.5034 3.3354 0.0366 0.0019 2.2235 1.0779 3.1743 2.8702 0.9472 3.8374 0.8677 0.5549 11.5882 16.0232 1.2231 1.9414 0.6145 0.0059 2.6769 6.6073 7.4371 16.7442 4.9349 58.7077 30.5892 0.3075 2.6133 0.1506 4.2457 54.9153 53.3754 39.1584 16.4337 0.7219 3.5059 7.0579 4.9868 3.0917 24.2054 16.2551 43.9983 7.9111 28.4704 7.9437 1.0151 0.0215 7.1185 7.8427 7.6966 12.0520 113.7717 12.3527 3.2217 42.8344 54.8928 89.3302 92.0873 7.4169 24.1869 111.3862 50.5532 54.9386 19.9227 249.1736 229.0266 25.9220 93.5142 30.2882 44.7089 123.8807 10.7789 9.7304 6.0263 15.3457 24.1779 11.4047 7.2889 13.0148 2.1466 3.7810 6.1060 13.0311
temp: 298.150 k
press: 1.00000 atm
elementType: 17 8 7 6 6 6 6 6 6 6 6 6 6 6 6 6 6 6 1 1 1 1 1 1 1 1 1 1 1 1
symmnumber: 1
zpe: 599560.2 jmol-1
zpe.correction: 0.228360 hartree
zpe.thermalcorrener: 0.242934 hartree
zpe.thermalcorrenthalpy: 0.243878 hartree
zpe.thermalcorrgfe: 0.185869 hartree
zpe.sumelectzpe: -1167.625460 hartree
zpe.sumelectthermal: -1167.610886 hartree
zpe.sumelectthermalent: -1167.609942 hartree
zpe.sumelectthermalfe: -1167.667951 hartree
dipole: -3.2147 -2.1210 0.0001
dipole: 3.8514
quadrupole: -109.1922 -99.7891 -115.8583
quadrupole: 25.3431 -0.0005 -0.0001
quadrupole: -0.9123 8.4908 -7.5785 25.3431 -0.0005 -0.0001
hfenergy: -1167.85382 hartree
pointgroup: C01 [X(C15H12Cl1N1O1)]
dipole: 1.2987999 -0.7804279 0.0009002 debye
polarizability: 343.822555|2.8239641|183.1180275|-0.0172466|-0.1360888|77.221713 unknown
InChI: InChI=1S/C15H12ClNO/c1-9(18)17-13-4-5-14-11(7-13)6-10-2-3-12(16)8-15(10)14/h2-5,7-8,17H,6H2,1H3
charge 0 multiplicity 1
30 atoms
Cl -5.780234 -1.447663 0.002335
O  4.506118 1.502425 -0.001966
N  3.799478 -0.738841 0.00096
C  -0.621395 1.861841 -0.002121
C  0.315622 0.658802 -0.000629
C  -0.4447 -0.549254 0.000963
C  -2.003079 1.218511 -0.001248
C  -1.876212 -0.205627 0.000582
C  1.718517 0.647492 -0.000704
C  0.217427 -1.796802 0.002525
C  -3.27413 1.81728 -0.001973
C  -3.019829 -1.035609 0.001693
C  2.38109 -0.612772 0.00088
C  1.624875 -1.821507 0.002477
C  -4.432389 0.998533 -0.000874
C  -4.277946 -0.404038 0.00093
C  4.773602 0.265244 -0.000359
C  6.206624 -0.271047 0.000148
H  -0.462323 2.506442 0.884297
H  -0.462388 2.504205 -0.890173
H  2.310902 1.564335 -0.00193
H  -0.343996 -2.737312 0.003764
H  -3.386608 2.907071 -0.003371
H  -2.943977 -2.126789 0.003081
H  2.150044 -2.785759 0.003695
H  -5.432682 1.440537 -0.001407
H  4.150123 -1.700028 0.002137
H  6.404724 -0.887847 0.896471
H  6.898807 0.582608 -0.000971
H  6.404531 -0.890031 -0.894712
