program: Gaussian 09
title: 000251939
version: EM64L-G09RevD.01
frameworkgroup: C1[X(C11H9N3O3S2)]
method: RPBEPBE
basis: SDD
operation: Freq
keyword: #p
keyword: freq=noraman
keyword: PBEPBE/SDD
title: #p freq=noraman PBEPBE/SDD
converged: YES YES NO NO
title: Mulliken charges:
elementType: S S O O O N N N C C C C C C C C C C C H H H H H H H H H
charge: 0.329272 0.295880 -0.179167 -0.210816 -0.212310 -0.362009 0.044746 0.023563 -0.219412 -0.090346 -0.210181 0.380397 -0.561074 -0.360027 -0.340024 -0.109347 -0.143543 0.226611 -0.776383 0.270432 0.254117 0.290913 0.290917 0.288140 0.327440 0.220768 0.270402 0.261039
chargesum: 0.00000
title: Mulliken charges with hydrogens summed into heavy atoms:
elementType: S S O O O N N N C C C C C C C C C C C
charge: 0.329272 0.295880 -0.179167 -0.210816 -0.212310 -0.034568 0.044746 0.023563 -0.219412 0.180086 0.043936 0.380397 -0.561074 -0.069114 -0.049107 -0.109347 0.144596 0.226611 -0.024174
polarizability: 3.27193334e+02 -6.74532386e+00 1.84928067e+02 -1.23447903e+01 4.35221371e+00 1.22316575e+02
1716.lowfreq: -4.0780 -1.5477 -0.0012 -0.0009 0.0022 5.1713 15.1275 20.6675 31.7973
frequency: 15.0647 20.6197 31.7658 37.7727 51.6720 70.4051 72.2935 88.1962 103.9801 154.5450 174.2250 219.5717 261.7026 268.8111 294.9671 306.0741 332.9089 396.8842 410.4219 440.7727 471.6425 494.3840 506.5011 519.8882 533.6469 567.1960 568.9011 589.8099 607.6237 620.8437 659.5015 662.8049 685.5242 724.8634 787.0942 792.2879 840.6268 852.0331 859.0126 871.0803 941.8656 983.8068 986.5072 992.5015 997.1469 1033.7563 1060.5312 1063.5339 1093.7038 1110.2112 1178.1729 1187.5193 1221.4200 1235.3116 1244.8137 1288.0965 1355.7409 1384.7483 1395.6492 1411.1949 1436.3033 1454.9619 1459.0068 1461.7355 1471.4281 1543.5448 1588.6631 1589.9933 1669.5997 2993.1388 3080.8662 3129.2748 3148.2997 3156.3862 3183.7590 3186.3020 3205.0295 3541.9718
redmass: 7.3093 5.8152 4.9879 7.3363 1.1449 5.5416 6.4196 8.1469 7.6005 7.5026 9.0163 9.6417 7.1032 6.6273 11.1756 5.7575 9.4559 4.8988 2.9295 8.3162 3.5028 8.4495 6.9079 5.4856 5.7631 2.2754 3.3128 2.5101 4.3023 7.1955 7.9046 5.0336 8.8582 4.4985 9.4341 6.6063 1.2719 1.5128 1.3799 4.7294 10.4468 1.3360 1.9238 1.3783 3.5819 1.6720 3.6400 3.3424 3.1017 1.2876 1.3620 3.3729 5.3630 1.3601 5.8171 1.2579 6.5800 1.2177 9.3767 4.4681 1.3584 1.8200 2.0191 2.4909 1.1083 6.4049 7.8300 6.4906 7.4401 1.0379 1.0985 1.0985 1.0906 1.0895 1.0950 1.0958 1.0962 1.0772
irintensity: 2.5046 3.0458 2.1679 0.5297 1.3913 2.5142 1.1362 2.8040 3.3704 0.3201 1.7331 0.0377 2.1053 2.7191 2.1298 0.4191 2.0144 0.0224 0.6843 3.6096 12.6687 17.9548 6.4758 25.3080 27.6620 34.8045 5.7452 40.1481 45.4608 1.3368 4.4045 21.2477 0.8305 8.8340 44.5197 9.2718 7.3018 41.9306 26.7711 4.4086 33.7502 4.1015 61.4141 2.9460 15.2593 16.4021 51.3187 119.8696 12.1971 10.2230 84.9064 300.1541 437.7468 2.1015 43.0340 0.9712 62.1240 78.0315 42.8029 31.4462 368.8438 67.8670 21.3074 197.3874 94.8655 253.7246 20.7768 155.5263 153.4992 6.7536 13.6079 6.9151 3.2288 0.7452 0.3460 2.5287 3.2407 32.4634
temp: 298.150 k
press: 1.00000 atm
elementType: 16 16 8 8 8 7 7 7 6 6 6 6 6 6 6 6 6 6 6 1 1 1 1 1 1 1 1 1
symmnumber: 1
zpe: 493067.3 jmol-1
zpe.correction: 0.187799 hartree
zpe.thermalcorrener: 0.206209 hartree
zpe.thermalcorrenthalpy: 0.207153 hartree
zpe.thermalcorrgfe: 0.136318 hartree
zpe.sumelectzpe: -1609.165261 hartree
zpe.sumelectthermal: -1609.146852 hartree
zpe.sumelectthermalent: -1609.145907 hartree
zpe.sumelectthermalfe: -1609.216742 hartree
dipole: -5.5885 -3.0705 -3.8484
dipole: 7.4478
quadrupole: -135.7822 -129.7683 -124.6053
quadrupole: -21.3363 21.9080 -5.8072
quadrupole: -5.7303 0.2837 5.4466 -21.3363 21.9080 -5.8072
hfenergy: -1609.3530606 hartree
pointgroup: C01 [X(C11H9N3O3S2)]
dipole: 2.2336185 1.666706 -0.9049597 debye
polarizability: 326.5883248|-13.172247|179.1367821|11.8255676|18.7783775|128.7128698 unknown
InChI: InChI=1S/C11H9N3O3S2/c1-7(15)13-11-12-6-10(19-11)18-9-4-2-8(3-5-9)14(16)17/h2-6,13H,1H3
charge 0 multiplicity 1
28 atoms
S  -0.371092 2.381728 1.058181
S  1.918963 1.269211 -0.845162
O  4.884942 -2.029219 0.555038
O  -4.682681 -2.525468 -0.962708
O  -6.10433 -0.742797 -0.849597
N  4.374804 -0.096477 -0.69593
N  3.123749 0.274749 1.350788
N  -4.933581 -1.278649 -0.731067
C  -1.695312 1.224769 0.493952
C  -1.460417 -0.147043 0.241502
C  -2.993594 1.777385 0.348433
C  -3.813787 -0.412012 -0.304979
C  1.128688 1.430508 0.790911
C  -2.525061 -0.973197 -0.163808
C  -4.062824 0.95578 -0.050079
C  3.301654 0.392182 0.047026
C  1.91869 0.836992 1.766607
C  5.149301 -1.258905 -0.393712
C  6.337749 -1.439577 -1.333848
H  -0.458048 -0.567629 0.365875
H  -3.167093 2.841639 0.539505
H  -2.376698 -2.037105 -0.366464
H  -5.0745 1.350993 -0.171774
H  1.657422 0.807832 2.824985
H  4.605066 0.398069 -1.560429
H  6.1440 -1.072303 -2.357468
H  6.59655 -2.508022 -1.376092
H  7.211136 -0.893934 -0.931085
