program: Gaussian 09
title: 000251928
version: EM64L-G09RevD.01
frameworkgroup: C1[X(C9H12N6O4)]
method: RPBEPBE
basis: SDD
operation: Freq
keyword: #p
keyword: freq=noraman
keyword: PBEPBE/SDD
title: #p freq=noraman PBEPBE/SDD
converged: YES YES NO NO
title: Mulliken charges:
elementType: O O O O N N N N N N C C C C C C C C C H H H H H H H H H H H H
charge: -0.246258 -0.441340 -0.445261 -0.434812 -0.126141 -0.105242 -0.073087 -0.022464 -0.064527 -0.600312 -0.191856 -0.171778 -0.111078 -0.101566 -0.377256 0.178714 -0.132942 0.217576 -0.332509 0.270387 0.275218 0.296459 0.260339 0.217074 0.253746 0.354138 0.362729 0.341583 0.253173 0.352547 0.344749
chargesum: 0.00000
title: Mulliken charges with hydrogens summed into heavy atoms:
elementType: O O O O N N N N N N C C C C C C C C C
charge: -0.246258 -0.087202 -0.082532 -0.093230 -0.126141 -0.105242 -0.073087 -0.022464 -0.064527 0.096985 0.078530 0.103440 0.185381 0.158772 0.093563 0.178714 -0.132942 0.217576 -0.079336
polarizability: 2.23270148e+02 -6.83684625e-01 1.49022308e+02 7.07521811e+00 -1.14488212e+00 9.15393999e+01
1716.lowfreq: -14.4455 -3.6389 -0.0006 -0.0003 0.0006 6.6685 29.4689 34.6861 62.2709
frequency: 29.2404 34.5286 62.2588 84.9448 119.8412 141.5736 143.1922 186.9121 197.1307 213.5709 235.2136 265.3437 277.3789 297.6282 313.2782 315.0018 358.2677 375.7704 416.6691 464.7719 505.6459 526.4803 542.4067 543.5928 559.7684 565.0533 626.0674 658.4164 677.9990 694.0997 698.9773 714.4696 748.9090 770.7637 806.7950 829.5909 863.1410 871.6735 920.5947 944.4044 948.8378 956.7947 962.5070 974.5896 1005.9392 1028.3954 1038.4316 1056.2312 1057.1950 1075.6048 1154.3381 1168.0928 1187.3342 1200.9770 1210.7346 1230.6527 1239.6757 1275.4362 1281.1576 1289.5254 1291.2960 1321.8469 1323.1740 1336.4026 1353.3613 1363.3571 1366.2769 1390.1866 1409.0263 1445.3005 1448.1138 1472.6614 1544.6697 1577.8313 1637.3997 2994.6673 3020.6293 3027.4825 3063.8430 3073.7268 3105.5450 3174.0676 3232.4174 3531.8751 3562.9155 3574.0621 3685.3891
redmass: 6.5921 7.0009 6.2048 4.9247 5.1341 5.1793 5.0864 7.0223 6.8511 4.8503 5.0378 4.1571 5.2781 2.6954 1.1669 2.1361 2.4183 5.2185 4.9438 6.2414 9.0755 4.5784 1.2914 3.2073 3.8428 1.2410 9.4977 6.2490 8.1252 7.2670 2.8065 1.5266 6.0225 5.0041 11.8755 2.6675 7.8617 4.1533 4.0011 1.4510 3.4901 4.2456 2.4056 3.5524 4.2482 4.7557 5.2636 2.5638 3.0986 1.6143 1.3956 1.4698 3.4824 4.4628 1.9912 2.7676 1.4654 1.2146 2.0036 1.2042 2.3626 3.7743 1.5701 1.3752 1.4526 1.2372 1.6453 1.5787 4.7679 2.5307 1.2916 1.0761 8.6924 2.0222 2.3746 1.0666 1.0860 1.0874 1.0864 1.0879 1.0994 1.0926 1.0688 1.0449 1.0663 1.0663 1.1055
irintensity: 1.0325 0.3728 3.8523 5.1571 0.6174 5.4637 6.6496 4.9457 3.0510 4.8403 4.3921 10.7782 0.3539 67.6216 235.2414 23.0173 29.8377 4.1431 13.6934 8.3331 2.3783 22.7685 101.5135 17.5594 3.1390 147.4524 2.6183 56.5681 2.3329 23.9381 48.8098 66.4802 45.7188 32.2752 7.7666 11.9969 9.0099 44.5682 119.6965 10.7889 50.4540 205.4708 20.4483 64.1163 64.9525 40.0479 55.9716 29.4210 6.2483 17.7160 4.1096 27.2743 5.6375 8.1604 63.1053 70.7662 8.7344 13.7086 5.6464 10.7674 42.2841 117.4000 18.8290 22.6638 13.7855 6.0907 23.8006 2.3595 28.2402 16.3043 68.8239 9.8584 151.5606 51.7881 568.4727 46.5236 36.4385 15.4743 28.1569 5.3341 12.1452 12.2679 649.8391 154.3027 9.5668 14.2466 55.2100
temp: 298.150 k
press: 1.00000 atm
elementType: 8 8 8 8 7 7 7 7 7 7 6 6 6 6 6 6 6 6 6 1 1 1 1 1 1 1 1 1 1 1 1
symmnumber: 1
zpe: 605737.1 jmol-1
zpe.correction: 0.230713 hartree
zpe.thermalcorrener: 0.247526 hartree
zpe.thermalcorrenthalpy: 0.248471 hartree
zpe.thermalcorrgfe: 0.185647 hartree
zpe.sumelectzpe: -978.085807 hartree
zpe.sumelectthermal: -978.068994 hartree
zpe.sumelectthermalent: -978.068050 hartree
zpe.sumelectthermalfe: -978.130873 hartree
dipole: -3.1025 1.2526 0.0302
dipole: 3.3460
quadrupole: -95.9656 -119.2954 -104.0551
quadrupole: -11.1337 -0.7599 -5.1027
quadrupole: 10.4731 -12.8567 2.3836 -11.1337 -0.7599 -5.1027
hfenergy: -978.3165201 hartree
pointgroup: C01 [X(C9H12N6O4)]
dipole: -1.1832158 -0.3054504 -0.489503 debye
polarizability: 222.5349363|10.9033102|108.7682377|0.2188828|26.3277775|132.528682 unknown
InChI: InChI=1S/C9H12N6O4/c10-7-4-8(12-2-11-7)15(14-13-4)9-6(18)5(17)3(1-16)19-9/h2-3,5-6,9,16-18H,1,10H2
charge 0 multiplicity 1
31 atoms
O  1.629067 -0.467034 1.110577
O  2.535592 2.40793 0.382993
O  2.415975 -0.423934 -2.089751
O  5.373179 -0.571089 0.675474
N  -0.32518 0.204575 -0.117113
N  -0.27752 -0.527686 -1.333677
N  -1.520942 -0.916212 -1.652775
N  -2.13588 0.860547 1.45157
N  -4.328425 0.044895 0.668316
N  -4.614114 -1.195622 -1.316574
C  1.880735 1.377669 -0.43197
C  2.859499 0.247048 -0.877949
C  0.910287 0.670854 0.545272
C  2.912007 -0.682732 0.359019
C  4.070474 -0.380866 1.330984
C  -1.629666 0.261933 0.334326
C  -2.374969 -0.446376 -0.650262
C  -3.788926 -0.544448 -0.447777
C  -3.490484 0.699336 1.534682
H  1.363913 1.81626 -1.306902
H  3.863948 0.638841 -1.109856
H  0.589311 1.339967 1.361283
H  2.926144 -1.739442 0.032336
H  3.968627 -1.011971 2.236083
H  4.044861 0.678291 1.629437
H  3.247014 2.840586 -0.153043
H  1.436345 -0.647052 -2.004097
H  5.496567 -1.530347 0.461205
H  -3.974507 1.151527 2.405149
H  -4.23961 -1.643956 -2.150675
H  -5.611823 -1.227989 -1.111884
