program: Gaussian 09
title: 000251911
version: EM64L-G09RevD.01
frameworkgroup: C1[X(C10H15NO3)]
method: RPBEPBE
basis: SDD
operation: Freq
keyword: #p
keyword: freq=noraman
keyword: PBEPBE/SDD
title: #p freq=noraman PBEPBE/SDD
converged: YES YES NO NO
title: Mulliken charges:
elementType: O O O N C C C C C C C C C C H H H H H H H H H H H H H H H
charge: -0.179035 -0.258355 -0.231183 -0.067796 -0.210938 -0.139525 -0.485333 -0.473357 -0.258195 -0.529505 0.145081 -0.649378 0.214729 -0.503837 0.251820 0.242974 0.272285 0.233205 0.235658 0.226023 0.291225 0.239908 0.245713 0.202269 0.232686 0.231096 0.233639 0.238621 0.249507
chargesum: 0.00000
title: Mulliken charges with hydrogens summed into heavy atoms:
elementType: O O O N C C C C C C C C C C
charge: -0.179035 -0.258355 -0.231183 -0.067796 0.040882 0.103449 0.020157 -0.011676 0.033030 -0.043884 0.145081 0.016672 0.214729 0.217930
polarizability: 1.41191948e+02 2.76904474e+00 1.08375698e+02 9.72638597e-01 -3.37982638e-01 1.00454894e+02
1716.lowfreq: -13.2042 -0.0009 -0.0006 -0.0004 7.1270 21.9770 28.7044 64.7887 84.6676
frequency: 28.5855 64.2568 84.6605 93.7666 103.1261 135.1782 170.4909 210.3688 218.9883 250.4044 254.2954 306.4297 336.4840 356.7439 376.1312 477.5068 488.7287 518.1074 621.9903 641.1841 699.5381 718.6808 731.5499 793.4730 795.4599 821.8212 839.9524 856.6782 909.6433 944.6471 964.5124 966.5365 991.0275 1018.7059 1049.9794 1072.9773 1096.7670 1111.2254 1112.9282 1118.5003 1126.5063 1150.1843 1153.9230 1168.4496 1193.3882 1212.0296 1226.6996 1232.6530 1256.6660 1279.7851 1282.8172 1294.3268 1311.6278 1327.7873 1344.1458 1420.9031 1427.8144 1430.8447 1452.5302 1462.7098 1465.8083 1469.5760 1486.1909 1490.9459 1623.6160 1644.8342 2897.2489 2995.5583 3006.0104 3010.3944 3018.3433 3026.4486 3030.1283 3049.2475 3061.7731 3068.8508 3076.9967 3083.8540 3101.1667 3109.5483 3151.3950
redmass: 5.2870 4.4800 1.6415 1.9048 2.7591 2.8720 2.9792 4.5326 1.0831 4.7273 3.2641 3.2990 4.2297 2.8442 3.1415 5.1299 3.4964 3.5616 3.9939 5.3017 5.3198 3.0059 4.3696 2.6858 2.5927 3.9446 2.2779 3.1307 3.4401 3.1461 2.4439 2.3830 2.6173 2.6596 2.0879 1.9284 1.7627 1.3955 1.4298 1.7327 2.2595 1.4286 1.3609 1.5037 2.6087 1.5669 1.2634 1.4232 1.4999 1.6266 1.7017 1.5342 1.4031 1.6120 1.5512 1.1882 1.0875 1.1646 1.0499 1.0505 1.0563 1.0680 1.0542 1.0831 9.8867 10.0814 1.0520 1.0616 1.0294 1.0610 1.0809 1.0669 1.0773 1.0879 1.0899 1.1018 1.0995 1.1006 1.1017 1.1047 1.1049
irintensity: 2.9186 2.0675 1.4190 0.5926 3.1309 2.1454 1.7347 5.2663 0.4682 0.3102 10.8059 7.5142 5.0967 0.8652 3.0876 12.1447 6.4614 1.8630 4.7085 11.6613 9.7705 5.8765 6.0710 6.8288 5.3191 3.4641 2.9332 3.1120 1.6248 22.1325 4.3575 5.0842 7.6002 21.5707 72.5833 9.1368 9.6056 24.4524 16.0795 118.9385 102.8879 13.4869 11.8554 4.8053 18.8096 16.0699 3.4780 19.4753 39.3583 14.9616 95.1304 2.6874 5.7871 52.9295 24.8769 20.7631 12.6976 5.3442 14.6382 10.8891 11.7248 11.9335 5.4291 23.9683 176.3228 138.2234 101.5063 8.8901 33.8564 18.9865 2.0299 21.6544 52.9442 43.3007 12.5263 21.0561 15.5951 31.3933 21.3391 22.8373 16.1862
temp: 298.150 k
press: 1.00000 atm
elementType: 8 8 8 7 6 6 6 6 6 6 6 6 6 6 1 1 1 1 1 1 1 1 1 1 1 1 1 1 1
symmnumber: 1
zpe: 627894.5 jmol-1
zpe.correction: 0.239152 hartree
zpe.thermalcorrener: 0.253052 hartree
zpe.thermalcorrenthalpy: 0.253996 hartree
zpe.thermalcorrgfe: 0.197873 hartree
zpe.sumelectzpe: -669.379253 hartree
zpe.sumelectthermal: -669.365353 hartree
zpe.sumelectthermalent: -669.364409 hartree
zpe.sumelectthermalfe: -669.420532 hartree
dipole: -2.3189 -1.6522 -1.4671
dipole: 3.2031
quadrupole: -68.2912 -86.0093 -87.3332
quadrupole: -3.3509 -3.8939 0.6714
quadrupole: 12.2534 -5.4648 -6.7886 -3.3509 -3.8939 0.6714
hfenergy: -669.618405 hartree
pointgroup: C01 [X(C10H15N1O3)]
dipole: 0.9019622 -0.7613881 0.4413677 debye
polarizability: 140.9097938|-4.0754445|108.3791691|-0.9687291|1.60255|100.7335768 unknown
InChI: InChI=1S/C10H15NO3/c1-11-6-3-4-7(11)9(8(12)5-6)10(13)14-2/h6-7,9H,3-5H2,1-2H3
charge 0 multiplicity 1
29 atoms
O  -0.919934 2.033717 -0.004371
O  -2.854057 -0.427266 0.816111
O  -2.13649 -0.925425 -1.340832
N  1.859346 -0.966009 0.640051
C  0.637917 -1.236261 -0.180576
C  2.304829 0.356679 0.096399
C  1.006633 -0.81346 -1.646339
C  2.147616 0.244645 -1.461135
C  -0.498639 -0.355464 0.436892
C  1.355242 1.441564 0.677192
C  -0.105364 1.141252 0.338309
C  2.885129 -2.032359 0.56293
C  -1.874922 -0.605498 -0.15875
C  -4.25688 -0.527711 0.342902
H  0.351656 -2.298541 -0.104085
H  3.341002 0.567059 0.411794
H  0.128561 -0.420413 -2.182184
H  1.367269 -1.689915 -2.212615
H  3.089606 -0.098944 -1.923787
H  1.892933 1.218081 -1.915588
H  -0.536514 -0.594334 1.516999
H  1.601293 2.449895 0.301148
H  1.462692 1.442834 1.779626
H  3.257004 -2.246386 -0.466923
H  2.466405 -2.966765 0.976219
H  3.750049 -1.746313 1.187016
H  -4.86754 -0.363116 1.241308
H  -4.443729 -1.523947 -0.0921
H  -4.451012 0.246103 -0.418111
