program: Gaussian 09
title: 000251914
version: EM64L-G09RevD.01
frameworkgroup: C1[X(C15H17NO4)]
method: RPBEPBE
basis: SDD
operation: Freq
keyword: #p
keyword: freq=noraman
keyword: PBEPBE/SDD
title: #p freq=noraman PBEPBE/SDD
converged: NO YES NO NO
title: Mulliken charges:
elementType: O O O O N C C C C C C C C C C C C C C C H H H H H H H H H H H H H H H H H
charge: -0.434415 -0.419899 -0.275480 -0.219727 -0.147655 -0.185558 -0.111186 -0.230394 -0.482259 -0.469792 -0.470087 -0.117912 0.132533 0.173089 0.266156 -0.335598 -0.382831 -0.244110 -0.225428 -0.229041 0.310792 0.277796 0.259677 0.214458 0.251432 0.239641 0.214705 0.258586 0.227034 0.222564 0.337980 0.377816 0.264301 0.262921 0.230953 0.229143 0.229796
chargesum: 0.00000
title: Mulliken charges with hydrogens summed into heavy atoms:
elementType: O O O O N C C C C C C C C C C C C C C C
charge: -0.096435 -0.042084 -0.275480 -0.219727 -0.147655 0.125234 0.166610 0.029283 -0.016369 -0.015446 0.015533 0.104652 0.132533 0.173089 0.266156 -0.071297 -0.119910 -0.013157 0.003716 0.000755
polarizability: 2.20568618e+02 4.71685902e+00 1.43010374e+02 6.86692717e+00 1.30569012e+01 1.55935815e+02
1716.lowfreq: -12.1018 -7.2461 -5.9364 -0.0008 -0.0005 0.0003 31.9236 33.8857 44.7452
frequency: 31.8429 33.7497 44.6573 55.4222 81.0676 102.9438 151.9510 164.2867 186.3226 202.4492 212.5777 244.3532 269.4991 308.8388 325.2920 342.9420 358.9225 381.7785 405.1189 422.0608 459.5062 499.6818 522.2045 561.7645 586.8874 614.1000 628.7553 663.0631 675.9584 695.1070 707.0676 713.5132 745.0381 761.3095 787.9184 802.1948 847.7164 852.6259 861.1675 879.9984 898.3127 930.5220 937.4057 968.5475 982.9687 987.8873 990.2611 999.7492 1001.7385 1012.3502 1023.4842 1028.2868 1047.9310 1066.3396 1081.7653 1112.8092 1117.6777 1144.8867 1159.5907 1172.6173 1182.7618 1189.2927 1212.4887 1215.8931 1224.4874 1235.3262 1261.9065 1269.5433 1285.8214 1298.1338 1307.0548 1316.2174 1317.8354 1322.1994 1336.3100 1373.0739 1380.6036 1396.6127 1405.5916 1432.8016 1455.4173 1470.0214 1480.6168 1484.0492 1548.6947 1590.4024 1610.4225 1665.9140 2958.7382 3011.0737 3018.7336 3024.2688 3033.0110 3064.9909 3084.2821 3087.4375 3088.2283 3094.1218 3126.2143 3137.3434 3149.5406 3159.0752 3168.4741 3505.3398 3548.7746
redmass: 6.3051 5.6594 5.1907 7.3536 5.8698 4.9894 8.1144 3.3913 2.4300 4.6369 4.8227 4.8521 4.1153 1.2179 3.2890 4.0582 4.9046 3.3701 2.8529 4.8738 3.5168 4.4112 4.7548 3.2655 4.7765 6.4004 1.6284 3.4385 3.7603 6.5809 1.6681 3.3088 4.9316 5.1076 2.2530 1.5130 2.7761 2.8256 1.2505 3.7823 2.8718 3.0314 1.5015 2.3979 1.4498 2.8540 4.1622 1.6753 1.6522 2.6873 2.4204 2.1391 2.5046 2.4549 1.5970 1.8690 2.4329 1.8001 1.4212 1.0565 1.2575 1.1637 1.4785 1.3771 1.4047 1.5318 1.3762 1.5142 1.4674 1.3045 1.4886 1.5397 1.3425 1.3736 1.4493 1.5466 8.5945 3.5848 1.5856 2.2392 1.0913 1.0804 2.3254 1.0988 10.9025 6.3810 6.0221 8.2758 1.0839 1.0592 1.0609 1.0632 1.0845 1.1039 1.1002 1.0911 1.0960 1.0967 1.0849 1.0883 1.0927 1.0960 1.1011 1.0638 1.0661
irintensity: 1.4209 1.6923 0.6262 3.0085 0.3016 1.5514 1.4871 0.6315 0.2329 0.0347 7.1789 0.1208 6.9139 128.0919 40.4293 0.8729 1.8126 16.2698 0.2687 4.1184 1.3651 22.6189 7.9024 9.5698 17.1040 0.0226 106.6791 35.5143 6.7081 4.2027 65.6927 28.6311 3.9770 6.2610 29.9350 16.7179 2.5651 7.1111 1.5321 9.8439 2.0845 26.5439 11.4744 4.7724 2.4949 19.5894 2.7897 11.8177 12.7008 13.2192 76.4805 19.8930 313.1692 31.3453 10.9020 23.2412 27.5022 18.2801 7.4115 0.4613 19.0235 2.3305 26.5028 31.8648 3.7730 12.0990 3.2823 17.1051 13.2331 13.4864 17.3716 38.2386 1.9315 6.8895 50.5906 56.9301 1.2670 304.9173 6.7284 11.7811 13.9422 9.6763 14.7382 13.1416 235.8113 16.0642 3.7596 181.8842 43.2819 19.8524 24.0247 44.6193 23.3235 1.0538 11.7630 18.5995 33.3537 22.9322 0.0508 7.8016 18.3399 20.3389 19.0471 27.8482 4.1537
temp: 298.150 k
press: 1.00000 atm
elementType: 8 8 8 8 7 6 6 6 6 6 6 6 6 6 6 6 6 6 6 6 1 1 1 1 1 1 1 1 1 1 1 1 1 1 1 1 1
symmnumber: 1
zpe: 779881.0 jmol-1
zpe.correction: 0.297041 hartree
zpe.thermalcorrener: 0.314579 hartree
zpe.thermalcorrenthalpy: 0.315524 hartree
zpe.thermalcorrgfe: 0.250572 hartree
zpe.sumelectzpe: -935.978701 hartree
zpe.sumelectthermal: -935.961163 hartree
zpe.sumelectthermalent: -935.960218 hartree
zpe.sumelectthermalfe: -936.025170 hartree
dipole: 2.1409 2.7574 -2.1795
dipole: 4.1155
quadrupole: -97.0343 -111.1876 -125.7915
quadrupole: 1.4322 7.8706 -2.4260
quadrupole: 14.3035 0.1502 -14.4537 1.4322 7.8706 -2.4260
hfenergy: -936.2757419 hartree
pointgroup: C01 [X(C15H17N1O4)]
dipole: -0.8574678 1.1136876 0.8038054 debye
polarizability: 221.4413592|-0.6425061|140.5630118|4.414542|-11.2840071|157.5104351 unknown
InChI: InChI=1S/C15H17NO4/c17-12-8-10-6-7-11(13(12)15(19)20)16(10)14(18)9-4-2-1-3-5-9/h1-5,10-13,17,19H,6-8H2
charge 0 multiplicity 1
37 atoms
O  -3.293109 -0.75051 2.11641
O  -3.138296 -2.303722 -1.195498
O  0.722787 0.073398 -2.456884
O  -1.197994 -2.185002 0.071612
N  -0.282071 0.62029 -0.43392
C  -1.624429 0.77475 -1.023715
C  -0.35416 1.317103 0.879217
C  -2.612174 -0.160488 -0.233698
C  -1.932733 2.28675 -0.769569
C  -1.058814 2.659815 0.481608
C  -1.223115 0.469045 1.847016
C  -2.634969 0.25802 1.27161
C  0.821517 0.260003 -1.199591
C  -2.206149 -1.617033 -0.396763
C  2.131887 0.07661 -0.481771
C  2.218487 -0.630183 0.745323
C  3.317027 0.538111 -1.108649
C  3.476324 -0.847739 1.349905
C  4.570809 0.334925 -0.4942
C  4.653077 -0.35526 0.739186
H  -1.593336 0.507652 -2.090991
H  0.652766 1.471797 1.294346
H  -3.622023 -0.04221 -0.667537
H  -3.009343 2.474918 -0.611288
H  -1.618561 2.869729 -1.651546
H  -0.302589 3.416832 0.212228
H  -1.657952 3.065818 1.315768
H  -0.761116 -0.520871 2.00154
H  -1.303035 0.970253 2.828583
H  -3.204608 1.209855 1.330774
H  -4.23653 -0.854682 1.829304
H  -2.828722 -3.242894 -1.317981
H  1.311107 -1.049478 1.192742
H  3.238875 1.039046 -2.079314
H  3.538697 -1.410132 2.288126
H  5.482274 0.703515 -0.977709
H  5.627894 -0.520625 1.211827
