program: Gaussian 09
title: 000251901
version: EM64L-G09RevD.01
frameworkgroup: C1[X(C12H12N2O3)]
method: RPBEPBE
basis: SDD
operation: Freq
keyword: #p
keyword: freq=noraman
keyword: PBEPBE/SDD
title: #p freq=noraman PBEPBE/SDD
converged: YES YES NO NO
title: Mulliken charges:
elementType: O O O N N C C C C C C C C C C C C H H H H H H H H H H H H
charge: -0.230986 -0.262292 -0.259422 -0.401707 0.048110 -0.351647 -0.465855 -0.465576 0.301366 0.505753 0.220842 0.173234 -0.484611 -0.393184 -0.393273 -0.330766 -0.201982 0.223010 0.269508 0.242315 0.242217 0.269426 0.275640 0.304699 0.205790 0.227000 0.252581 0.240201 0.239608
chargesum: 0.00000
title: Mulliken charges with hydrogens summed into heavy atoms:
elementType: O O O N N C C C C C C C C C C C C
charge: -0.230986 -0.262292 -0.259422 -0.126067 0.048110 -0.128636 0.045968 0.046067 0.301366 0.505753 0.220842 0.173234 -0.179912 -0.187393 -0.166273 -0.078185 0.277827
polarizability: 3.28381320e+02 -3.97142629e+00 1.52927213e+02 5.43324365e-02 3.87958884e-02 7.97548296e+01
1716.lowfreq: -36.9012 -3.9348 0.0003 0.0003 0.0006 4.3550 10.8539 34.9443 44.1710
frequency: -36.8681 34.9374 44.1505 44.7330 66.9961 128.4250 146.9743 207.5232 214.2047 224.1935 243.3514 254.7878 307.8046 362.0728 373.3926 408.8107 438.8126 479.9181 572.8554 603.7440 611.0096 618.8155 661.3303 681.2750 700.9339 723.5701 764.2860 784.9458 793.8654 804.3387 808.0080 841.0817 860.5300 883.6268 907.0349 923.5358 924.0072 943.6951 962.4043 981.5400 1045.2155 1054.8538 1061.5684 1064.7142 1079.3917 1086.9930 1088.7346 1119.9690 1130.5207 1160.2753 1177.0331 1195.9003 1211.2203 1254.9178 1262.9727 1332.8153 1365.3286 1377.2948 1396.0800 1425.7124 1449.6147 1456.0761 1472.6673 1486.2811 1506.1696 1574.5697 1607.6982 1623.9250 1637.4654 2959.8069 3015.2977 3093.8810 3102.5616 3106.7700 3119.0959 3135.2278 3182.8305 3186.0250 3208.7332 3226.8461 3369.7531
redmass: 2.3377 5.2449 6.0460 4.1903 4.2012 5.6382 5.5770 3.9757 4.3455 6.4964 4.0261 5.0630 3.8425 7.0273 4.7003 6.0574 3.2329 5.8379 6.1051 1.6328 7.5747 2.2480 3.0041 8.9604 5.1502 4.3828 5.5991 1.7161 2.0377 2.0329 1.3562 9.6702 4.3536 2.0210 1.3516 4.3790 1.3922 1.5309 4.0741 4.0041 2.6407 1.6875 3.7158 1.4576 1.0959 1.3418 1.4755 1.0370 1.5012 2.2455 1.3608 1.7874 2.2751 1.7808 2.0090 1.7054 1.2880 1.9170 3.4758 1.0870 1.3632 4.2597 2.3654 1.2274 2.1201 6.7188 7.5983 7.9099 6.9254 1.0867 1.0535 1.1189 1.0504 1.0645 1.0877 1.0899 1.0950 1.0943 1.1181 1.1161 1.0751
irintensity: 16.3797 1.9048 2.8483 5.8353 0.7456 0.3739 0.4606 11.4692 2.7968 2.7986 4.9806 15.7388 3.8635 1.0319 2.4994 8.4001 3.6932 3.0116 7.2679 18.7077 10.6986 66.9380 6.4185 0.6497 2.7461 3.7934 9.4287 14.9366 5.3857 11.6216 35.2935 17.1171 8.8072 6.5341 1.2592 60.7593 31.7857 31.4051 38.8560 203.8850 11.4754 5.9245 7.0111 4.3823 14.2863 1.8532 2.3275 0.0090 128.8502 528.0091 0.2685 38.2758 2.4562 135.6452 167.4313 38.8324 5.4247 89.3632 63.3602 12.2102 12.4933 101.5552 232.2163 21.8011 217.7852 18.5905 1.4444 23.8251 151.7892 65.5290 138.6295 31.2037 15.5893 15.3852 15.4588 10.8888 4.2362 6.6608 0.4963 11.9482 16.8964
temp: 298.150 k
press: 1.00000 atm
elementType: 8 8 8 7 7 6 6 6 6 6 6 6 6 6 6 6 6 1 1 1 1 1 1 1 1 1 1 1 1
symmnumber: 1
zpe: 578695.5 jmol-1
zpe.correction: 0.220413 hartree
zpe.thermalcorrener: 0.234828 hartree
zpe.thermalcorrenthalpy: 0.235772 hartree
zpe.thermalcorrgfe: 0.177222 hartree
zpe.sumelectzpe: -798.337288 hartree
zpe.sumelectthermal: -798.322874 hartree
zpe.sumelectthermalent: -798.321930 hartree
zpe.sumelectthermalfe: -798.380480 hartree
dipole: -0.0620 4.6557 0.0001
dipole: 4.6561
quadrupole: -75.2476 -92.8048 -100.4262
quadrupole: 18.6991 0.2381 0.0158
quadrupole: 14.2453 -3.3119 -10.9333 18.6991 0.2381 0.0158
hfenergy: -798.5577017 hartree
pointgroup: C01 [X(C12H12N2O3)]
dipole: -0.0394691 1.6958331 -0.6915965 debye
polarizability: 328.0480641|1.354174|142.5017119|10.0289549|-25.4322911|90.5135861 unknown
InChI: InChI=1S/C12H12N2O3/c15-12(9-2-3-9)14-13-6-8-1-4-10-11(5-8)17-7-16-10/h1,4-6,9,14H,2-3,7H2
charge 0 multiplicity 1
29 atoms
O  3.406757 -1.288491 0.77161
O  -3.582128 -1.782309 0.697557
O  -5.173738 -0.141584 -0.042965
N  2.552645 0.734137 -0.077082
N  1.230384 0.346859 0.023004
C  4.960112 0.473617 0.135449
C  6.043097 0.075164 1.167173
C  6.108933 -0.491927 -0.242665
C  3.595953 -0.129509 0.315821
C  -1.112859 0.883371 -0.291069
C  -2.914224 -0.61669 0.245933
C  -3.856631 0.347624 -0.188845
C  -1.544649 -0.38884 0.211027
C  0.313623 1.210801 -0.364215
C  -2.065095 1.847021 -0.725378
C  -3.460825 1.593219 -0.680879
C  -5.030771 -1.518262 0.512585
H  5.010647 1.490287 -0.270806
H  5.710169 -0.5989 1.960878
H  6.759228 0.846029 1.464332
H  6.87169 -0.118391 -0.931266
H  5.819578 -1.538072 -0.373654
H  2.799009 1.668182 -0.441007
H  -0.808954 -1.124759 0.543696
H  0.571755 2.21561 -0.760095
H  -1.714378 2.813317 -1.106114
H  -4.192363 2.332962 -1.014299
H  -5.53516 -1.560326 1.492923
H  -5.441109 -2.239645 -0.214951
