program: Gaussian 09
title: 000251899
version: EM64L-G09RevD.01
frameworkgroup: C1[X(C15H14N2O)]
method: RPBEPBE
basis: SDD
operation: Freq
keyword: #p
keyword: freq=noraman
keyword: PBEPBE/SDD
title: #p freq=noraman PBEPBE/SDD
converged: YES YES NO NO
title: Mulliken charges:
elementType: O N N C C C C C C C C C C C C C C C H H H H H H H H H H H H H H
charge: -0.229293 -0.405468 0.054329 -0.351493 -0.465296 -0.465006 0.299694 0.221115 0.285499 0.408740 -0.378945 -0.385730 -0.369454 -0.439356 -0.422417 -0.239389 -0.255779 -0.247409 0.223690 0.269496 0.243006 0.243001 0.269639 0.275500 0.194387 0.287659 0.210742 0.240019 0.238610 0.232253 0.227197 0.230459
chargesum: 0.00000
title: Mulliken charges with hydrogens summed into heavy atoms:
elementType: O N N C C C C C C C C C C C C C C C
charge: -0.229293 -0.129968 0.054329 -0.127802 0.047206 0.047634 0.299694 0.221115 0.285499 0.408740 -0.184558 -0.098071 -0.158712 -0.199337 -0.183807 -0.007136 -0.028582 -0.016950
polarizability: 3.62769855e+02 -7.39063518e+00 1.98837964e+02 1.61564863e-01 4.80059562e-02 8.45226293e+01
1716.lowfreq: -10.6383 -1.5826 -0.0007 0.0002 0.0004 2.6455 23.6733 34.1574 47.7448
frequency: 23.6219 34.1274 47.7265 60.6534 111.9526 154.3591 164.5805 182.9986 194.6641 206.3178 260.0887 267.1717 332.6302 360.0061 423.9968 426.9766 462.8735 474.3521 505.5592 532.6761 554.0718 617.0472 639.2435 650.8029 660.1099 700.4667 744.2293 759.4813 786.3158 787.6288 788.6867 802.8699 816.4028 847.7795 878.2057 881.7959 882.2977 922.4018 943.7200 955.0683 963.0746 990.5466 1002.6188 1013.0161 1035.3183 1047.9471 1066.7863 1077.5411 1086.9147 1087.2543 1092.3241 1150.8204 1160.4932 1177.2224 1177.2399 1191.2302 1208.8987 1237.5927 1255.8675 1274.7932 1341.8179 1370.3146 1384.0851 1405.2109 1413.3579 1425.0131 1442.1524 1447.8877 1454.9729 1499.3382 1520.8050 1562.4310 1587.3399 1592.4155 1630.5892 1637.1708 2993.4129 3102.6563 3106.6500 3118.5316 3123.1923 3126.7165 3132.1340 3147.9822 3148.7856 3164.2877 3166.3222 3208.8301 3226.9185 3363.0174
redmass: 3.4431 5.2930 5.0984 3.8328 3.6533 5.3343 4.0609 3.7719 6.1828 3.2759 4.8084 3.0584 4.0689 6.0394 5.3393 2.9875 6.3600 3.2681 6.5424 6.8311 2.8640 1.2403 6.2809 3.1951 2.9359 5.1289 1.3283 4.6265 4.6947 1.1670 1.8822 2.0594 1.4253 3.8685 4.5352 1.9190 1.9939 1.5454 1.4033 4.4301 1.4132 1.3453 1.3884 4.2949 2.3678 1.3498 3.2946 1.1000 1.3557 1.4850 2.0030 1.5783 2.0138 1.3622 1.0957 1.2737 2.2368 1.8798 1.6622 1.9201 1.5739 1.9598 2.2038 2.5773 5.7465 1.0871 2.4840 1.3730 2.2810 1.9699 3.7763 4.9514 7.0883 5.4667 6.4217 6.8807 1.0855 1.0503 1.0647 1.0877 1.0856 1.0872 1.0880 1.0928 1.0938 1.1003 1.0980 1.1181 1.1162 1.0750
irintensity: 4.2680 5.3167 2.8943 0.6022 1.5189 0.3463 0.3528 5.2268 1.6005 18.2573 18.5872 1.0916 0.9126 5.8440 0.1459 8.8513 0.5504 1.5829 0.4220 0.9479 12.5683 63.5545 16.7027 0.7147 6.0450 2.3113 9.2168 2.4014 5.0160 5.7712 83.3702 10.7139 42.3064 5.7656 8.8719 0.8543 14.0031 25.1305 7.5068 103.0892 1.7768 0.0220 3.7373 20.1840 4.7072 19.8322 5.4575 14.6585 1.6414 2.8318 20.0340 115.8544 516.5664 0.2862 4.8473 31.5071 6.7459 3.7884 27.3698 8.6069 15.2683 50.6930 115.9820 3.3610 6.4354 12.3118 6.6744 7.4723 11.1389 288.1044 64.3703 10.2772 6.9427 0.6711 6.0070 169.7462 47.0150 15.2083 15.5162 13.8959 1.7329 1.9622 2.7694 5.2136 56.1734 38.9169 9.3829 0.5156 11.4748 15.2704
temp: 298.150 k
press: 1.00000 atm
elementType: 8 7 7 6 6 6 6 6 6 6 6 6 6 6 6 6 6 6 1 1 1 1 1 1 1 1 1 1 1 1 1 1
symmnumber: 1
zpe: 663854.5 jmol-1
zpe.correction: 0.252849 hartree
zpe.thermalcorrener: 0.268330 hartree
zpe.thermalcorrenthalpy: 0.269274 hartree
zpe.thermalcorrgfe: 0.208095 hartree
zpe.sumelectzpe: -763.412489 hartree
zpe.sumelectthermal: -763.397007 hartree
zpe.sumelectthermalent: -763.396063 hartree
zpe.sumelectthermalfe: -763.457243 hartree
dipole: 0.9985 -4.6648 0.0095
dipole: 4.7704
quadrupole: -88.6391 -95.0686 -110.4547
quadrupole: 16.6178 0.0114 0.0385
quadrupole: 9.4150 2.9856 -12.4006 16.6178 0.0114 0.0385
hfenergy: -763.6653375 hartree
pointgroup: C01 [X(C15H14N2O1)]
dipole: 0.3916602 1.7473313 0.5621028 debye
polarizability: 362.5235807|4.6818814|188.2779445|10.0044288|33.0781398|95.3289235 unknown
InChI: InChI=1S/C15H14N2O/c18-15(12-8-9-12)17-16-10-13-6-3-5-11-4-1-2-7-14(11)13/h1-7,10,12,17H,8-9H2
charge 0 multiplicity 1
32 atoms
O  -3.943168 -1.196564 -0.546603
N  -2.492467 0.557279 0.054995
N  -1.342177 -0.178337 -0.140621
C  -4.891415 0.949288 0.101055
C  -6.15292 0.813019 -0.786717
C  -6.204254 0.350404 0.661139
C  -3.766551 -0.009285 -0.16524
C  2.355479 0.354895 0.141381
C  1.078227 -0.29322 -0.102118
C  3.573238 -0.410266 -0.068059
C  -0.190582 0.424294 0.086487
C  1.052199 -1.637342 -0.529812
C  2.489761 1.716461 0.57985
C  3.492161 -1.772111 -0.503447
C  4.847288 0.208215 0.164113
C  2.250175 -2.373424 -0.729407
C  3.744458 2.291521 0.797791
C  4.938358 1.533355 0.588643
H  -4.624305 1.959031 0.432817
H  -6.104628 0.038487 -1.556794
H  -6.667118 1.73569 -1.06895
H  -6.756152 0.947885 1.391728
H  -6.189056 -0.727961 0.840433
H  -2.439969 1.54041 0.366707
H  -0.154895 1.478312 0.421945
H  0.077192 -2.102236 -0.706167
H  1.600733 2.331101 0.752713
H  4.420753 -2.334696 -0.656428
H  5.75422 -0.385971 -0.000093
H  2.192956 -3.415233 -1.061988
H  3.81639 3.332458 1.132227
H  5.915769 1.995844 0.762816
