program: Gaussian 09
title: 000251890
version: EM64L-G09RevD.01
frameworkgroup: C1[X(C22H24N2O3)]
method: RPBEPBE
basis: SDD
operation: Freq
keyword: #p
keyword: freq=noraman
keyword: PBEPBE/SDD
title: #p freq=noraman PBEPBE/SDD
converged: YES YES NO NO
title: Mulliken charges:
elementType: O O O N N C C C C C C C C C C C C C C C C C C C C C C H H H H H H H H H H H H H H H H H H H H H H H H
charge: -0.268914 -0.256245 -0.262781 -0.045704 -0.216491 0.224731 -0.266496 -0.232129 -0.120464 -0.242518 -0.535029 -0.534167 0.266403 -0.407389 -0.109082 0.495151 -0.655468 0.209796 -0.570911 0.105156 -0.599385 -0.450736 -0.334282 -0.319062 0.308828 -0.359073 -0.536064 0.279924 0.236532 0.245984 0.228019 0.223673 0.236938 0.249218 0.229561 0.229533 0.204381 0.228372 0.241708 0.229613 0.262830 0.253067 0.250930 0.234858 0.188465 0.219284 0.304407 0.252518 0.217815 0.218609 0.246086
chargesum: 0.00000
title: Mulliken charges with hydrogens summed into heavy atoms:
elementType: O O O N N C C C C C C C C C C C C C C C C C C C C C C
charge: -0.268914 -0.256245 -0.262781 -0.045704 -0.216491 0.224731 0.013428 0.004403 0.125521 -0.014499 -0.074418 -0.055388 0.266403 0.026525 0.119290 0.495151 -0.184147 0.209796 -0.055015 0.105156 -0.348455 -0.215878 0.073468 -0.014655 0.308828 -0.106554 0.146447
polarizability: 3.24464016e+02 -1.18569443e+01 2.62259745e+02 -1.16493276e+01 -1.57546332e+00 1.65778042e+02
1716.lowfreq: -5.4820 -0.0004 0.0006 0.0007 2.6936 8.1632 38.5537 62.5051 80.7573
frequency: 38.5303 62.4849 80.7485 90.1190 110.2735 115.0994 135.8153 184.4533 196.1941 213.1872 220.4252 240.8029 249.3225 272.3828 281.4757 290.7164 314.7807 343.4748 352.9497 373.7565 377.7173 394.2296 400.1339 426.6766 442.2348 453.0165 472.0518 481.6706 489.5072 507.9967 514.7928 550.7042 563.2548 603.9226 610.1119 624.6000 631.4927 652.3286 657.1174 669.9932 688.0014 735.0052 748.2437 757.6164 774.5396 795.3856 827.4194 827.6553 840.8772 848.2548 855.6516 883.5429 898.2996 909.8483 930.6502 934.9480 951.6082 964.3297 969.3628 976.6499 983.7689 992.6484 1005.7991 1016.6362 1022.4151 1029.9352 1056.4286 1067.7211 1077.6031 1084.0616 1089.2315 1096.2534 1104.0358 1111.2488 1118.7872 1122.3582 1139.5987 1151.2039 1160.2423 1170.4524 1179.0102 1190.8340 1197.7826 1199.2756 1217.6087 1221.9985 1232.8221 1241.5039 1260.4085 1267.2025 1268.7640 1278.4912 1284.3725 1289.8300 1291.9425 1298.4013 1303.6164 1316.5805 1322.2446 1327.1628 1334.5413 1344.4740 1347.7757 1353.3936 1363.2779 1375.2582 1380.2377 1391.2407 1425.6387 1444.8509 1451.7034 1454.5986 1460.9935 1466.2493 1470.0270 1472.2940 1485.0547 1486.8662 1496.0583 1584.5150 1603.5295 1619.7031 1673.6197 2908.5748 2929.7444 2934.2042 2946.5844 2952.6719 2954.7275 2958.2009 2981.7440 3000.3776 3000.8927 3006.7365 3007.3177 3022.9520 3037.8403 3053.7343 3059.6301 3071.4839 3078.9640 3099.5878 3109.0386 3122.0953 3148.1392 3163.8006 3197.6592
redmass: 4.5185 3.4869 4.4649 4.2018 5.3763 3.8127 4.1051 3.1135 3.2462 2.6118 2.9550 3.3141 1.8039 4.5348 4.0027 2.9167 3.3069 4.0600 4.4415 4.1180 5.1170 3.4542 4.0332 2.2563 3.0847 3.6443 3.9484 4.9863 4.0804 3.6805 4.3990 3.9487 3.2467 4.5554 4.0903 4.6080 3.3039 3.9226 4.7621 4.7612 4.4249 3.2894 3.8290 4.3514 3.5218 3.6108 1.7251 3.1452 1.4295 1.8301 1.7469 2.9304 3.7656 2.7100 2.2891 2.9509 2.9247 2.6917 1.3258 2.7651 2.8197 4.7956 3.1149 2.2452 2.0024 2.9332 2.9753 2.2426 2.4630 2.6539 2.8225 2.1759 2.0501 1.2613 2.7595 2.8150 2.2636 1.4302 1.6107 1.4930 1.6115 1.8593 1.8235 1.6937 1.2794 1.8036 1.1899 1.4314 2.0032 1.9583 1.5518 1.5736 1.2647 1.4003 1.4307 1.3988 1.2736 1.5713 1.4791 1.4143 1.4594 1.3989 1.3850 1.4550 1.4147 1.7003 2.9578 5.1964 1.6836 1.1003 2.0704 1.0903 1.0865 1.0504 1.2269 1.0889 2.2542 1.0811 1.1000 8.8730 9.4447 7.1856 8.0993 1.0708 1.0702 1.0823 1.0824 1.0340 1.0835 1.0840 1.0650 1.0810 1.0709 1.0684 1.0639 1.0836 1.1037 1.0996 1.1011 1.0930 1.1039 1.0957 1.0925 1.0987 1.0905 1.0903 1.0957
irintensity: 1.0107 2.7041 0.3650 1.9203 3.7464 1.6673 4.1285 3.8159 0.3660 2.6762 3.1257 1.6244 1.6315 0.1807 1.8792 1.6677 4.7408 18.5663 1.0810 2.3205 7.6358 0.5988 3.7334 2.3517 2.3740 8.6181 5.5961 4.0611 14.4374 8.0737 12.4910 3.4366 0.1054 1.6495 0.5449 3.3285 2.6008 5.1561 3.3146 0.3907 11.3819 1.9495 2.0078 8.6613 9.8572 2.9787 3.4668 19.6998 17.2215 60.4763 5.8899 3.3650 19.3748 3.7363 9.8843 2.2602 0.9518 13.4157 1.3602 23.1134 26.2732 39.9895 16.3841 15.7026 2.8478 11.0796 0.3484 11.5322 13.5896 7.9004 32.5276 7.1289 14.8715 0.1749 17.4896 2.3118 14.5578 13.6449 31.6301 16.5954 6.0729 59.4071 32.6926 0.8828 24.5011 6.1340 16.5467 20.6714 45.9004 114.3444 46.4905 2.7698 3.2988 0.8979 0.9858 8.4904 1.1091 9.2354 1.9581 9.9229 5.5120 1.1102 0.7149 1.5510 21.4014 5.4818 37.7984 76.9638 42.4776 16.3021 2.3016 11.1742 18.5233 13.5828 139.0568 52.9410 161.3411 15.6412 1.5992 257.9018 75.9057 43.7618 17.2364 43.0496 51.6823 62.0599 8.9240 57.3204 60.1244 47.6682 41.1422 7.5101 5.7188 14.8519 57.5614 64.8527 51.5749 38.7805 13.7026 29.3299 17.8681 11.9423 32.1504 30.2413 8.0589 5.4309 1.9393
temp: 298.150 k
press: 1.00000 atm
elementType: 8 8 8 7 7 6 6 6 6 6 6 6 6 6 6 6 6 6 6 6 6 6 6 6 6 6 6 1 1 1 1 1 1 1 1 1 1 1 1 1 1 1 1 1 1 1 1 1 1 1 1
symmnumber: 1
zpe: 1105536.8 jmol-1
zpe.correction: 0.421077 hartree
zpe.thermalcorrener: 0.441780 hartree
zpe.thermalcorrenthalpy: 0.442724 hartree
zpe.thermalcorrgfe: 0.373784 hartree
zpe.sumelectzpe: -1185.915813 hartree
zpe.sumelectthermal: -1185.895110 hartree
zpe.sumelectthermalent: -1185.894166 hartree
zpe.sumelectthermalfe: -1185.963106 hartree
dipole: -2.2004 -5.6115 -1.3959
dipole: 6.1870
quadrupole: -149.7455 -172.7555 -154.0237
quadrupole: -10.8964 2.6388 -1.9829
quadrupole: 9.0961 -13.9140 4.8179 -10.8964 2.6388 -1.9829
hfenergy: -1186.3368901 hartree
pointgroup: C01 [X(C22H24N2O3)]
dipole: -0.9555912 -2.1846427 -0.4891807 debye
polarizability: 323.1363559|-14.4726963|263.1539014|-13.5323572|-3.0378613|166.2115455 unknown
InChI: InChI=1S/C22H24N2O3/c1-26-13-2-3-16-15(8-13)22-5-6-23-11-12-4-7-27-17-10-19(25)24(16)21(22)20(17)14(12)9-18(22)23/h2-4,8,14,17-18,20-21H,5-7,9-11H2,1H3
charge 0 multiplicity 1
51 atoms
O  -3.587721 1.508431 0.331341
O  0.553454 3.933039 0.051602
O  5.357049 -0.670452 -0.49669
N  -1.130006 -2.776775 0.494539
N  0.315227 1.636206 0.437077
C  0.324416 -0.801679 0.497912
C  -0.616603 0.457375 0.427155
C  -0.167724 -2.005607 -0.380729
C  -1.492841 0.637817 -0.838233
C  -2.06726 -0.698639 -1.386214
C  -0.83739 -1.588618 -1.706135
C  0.274433 -1.448128 1.920098
C  1.694162 -0.219127 0.178009
C  -1.034943 -2.262401 1.896013
C  -2.459854 1.823505 -0.568403
C  -3.014881 -1.456609 -0.441426
C  -2.524571 -2.843241 -0.037807
C  1.655178 1.19513 0.21913
C  -1.720277 2.991396 0.157032
C  -0.188745 2.913416 0.201438
C  2.906702 -0.896272 -0.053304
C  -4.149092 -0.900206 0.063569
C  -4.559071 0.530839 -0.216923
C  2.822656 1.96999 0.033923
C  4.082682 -0.125219 -0.251371
C  4.034815 1.292295 -0.205092
C  5.46887 -2.127714 -0.546207
H  -1.275658 0.494111 1.315372
H  0.713267 -2.641868 -0.602318
H  -0.813558 1.003224 -1.639575
H  -2.613921 -0.466951 -2.325746
H  -1.127708 -2.489449 -2.276604
H  -0.109189 -1.035677 -2.328409
H  0.300863 -0.693702 2.724946
H  1.148285 -2.113504 2.046642
H  -1.023027 -3.093862 2.624653
H  -1.900946 -1.606692 2.145759
H  -2.874623 2.166431 -1.542405
H  -3.171751 -3.280689 0.742853
H  -2.546183 -3.541538 -0.896596
H  -2.10041 2.990498 1.197707
H  -1.978286 3.969336 -0.277682
H  2.932856 -1.990298 -0.074028
H  -4.778887 -1.483792 0.748542
H  -4.679367 0.713587 -1.308716
H  -5.511596 0.774042 0.281867
H  2.770945 3.059563 0.066097
H  4.965846 1.845936 -0.359202
H  4.849914 -2.554448 -1.360363
H  5.179009 -2.589038 0.418677
H  6.531459 -2.329373 -0.746677
