program: Gaussian 09
title: 000251840
version: EM64L-G09RevD.01
frameworkgroup: C1[X(C16H11NO2)]
method: RPBEPBE
basis: SDD
operation: Freq
keyword: #p
keyword: freq=noraman
keyword: PBEPBE/SDD
title: #p freq=noraman PBEPBE/SDD
converged: YES YES NO NO
title: Mulliken charges:
elementType: O O N C C C C C C C C C C C C C C C C H H H H H H H H H H H
charge: -0.313576 -0.233348 0.001386 0.112379 0.427522 0.282035 -0.452487 -0.350563 -0.420646 -0.344002 -0.228703 -0.236295 -0.237216 0.211324 0.175271 -0.246739 -0.407477 -0.181517 -0.320452 0.240529 0.251358 0.240124 0.302353 0.231327 0.231913 0.230403 0.279002 0.266834 0.239572 0.249687
chargesum: 0.00000
title: Mulliken charges with hydrogens summed into heavy atoms:
elementType: O O N C C C C C C C C C C C C C C C C
charge: -0.313576 -0.233348 0.001386 0.112379 0.427522 0.282035 -0.211958 -0.099204 -0.180522 -0.041649 0.002625 -0.004382 -0.006813 0.211324 0.175271 0.032262 -0.140643 0.058055 -0.070765
polarizability: 2.94012118e+02 1.73092793e+00 2.22770214e+02 3.42081719e+00 5.43936876e-01 7.13299264e+01
1716.lowfreq: 0.0004 0.0006 0.0007 3.6340 8.0136 8.6881 15.1480 39.1286 58.1127
frequency: 14.9001 39.0427 58.0960 70.8949 133.7991 169.6887 176.8001 187.4555 224.6103 275.0434 308.3084 373.9904 406.8648 418.0265 430.4271 457.3531 469.3250 504.2368 516.3594 567.8067 583.3536 611.4455 636.5639 680.4794 686.1111 716.4958 726.1373 748.4994 776.5138 785.0067 790.4783 815.3432 832.6958 864.4808 882.7527 924.1779 933.4562 964.2230 967.7267 983.3785 986.1609 996.7904 1005.5298 1007.4112 1022.0774 1031.2896 1060.9096 1089.2631 1109.3263 1145.6005 1171.8280 1181.4781 1196.9330 1209.9933 1236.5836 1245.9795 1263.7241 1312.6965 1326.1642 1375.5437 1403.4706 1409.0734 1422.2923 1440.7585 1449.7643 1454.0615 1513.3443 1549.8437 1577.0253 1584.6026 1597.4351 1619.5934 1637.8048 3125.4145 3131.8228 3138.0524 3139.6049 3155.6990 3157.4266 3158.8974 3167.8747 3176.3214 3179.3590 3213.7524
redmass: 5.7807 5.0636 6.3556 6.4495 4.8524 4.8721 4.1515 5.3001 7.2270 4.5117 7.7808 2.9032 5.1503 3.4320 4.3830 6.6111 3.3233 7.4703 7.3348 3.3494 8.2331 7.6516 3.4490 6.8945 7.3997 1.8129 7.4131 1.3442 6.9525 2.0810 5.3688 1.5233 1.7114 5.4570 1.6528 1.3940 1.4000 1.4865 1.3759 5.8014 1.3793 1.3424 1.4201 3.8945 3.1239 2.5575 2.5987 2.6002 1.6202 1.5075 1.0903 1.3713 1.3446 1.9867 1.9528 2.8616 1.6682 11.0741 1.2598 2.1102 3.6485 2.1625 4.5324 2.7345 2.3664 2.2021 3.8432 5.8860 7.1446 6.1389 5.6709 10.9022 7.3079 1.0864 1.0874 1.0888 1.0903 1.0915 1.0968 1.0966 1.0923 1.1001 1.0963 1.0940
irintensity: 0.1570 2.5012 1.1607 0.9274 0.0877 2.4587 2.2558 1.0182 0.6772 0.7544 19.2222 0.4343 3.0176 8.2984 0.1762 0.9598 0.0479 0.9233 0.1185 10.9026 7.4413 1.6332 0.5993 2.3059 8.1446 49.6856 6.1756 1.3015 2.5273 62.6130 10.1294 87.5189 23.2715 1.4658 7.8144 0.6313 1.9136 1.0571 1.2712 44.1728 7.4776 0.1855 1.2768 8.3821 33.0883 2.8053 190.0936 256.7623 8.3039 32.9672 7.9866 79.3720 15.6755 126.6186 45.3546 256.0667 1.1664 2.1890 0.8536 34.3271 21.2783 15.7688 2.8338 4.6089 9.3366 13.1100 18.9284 1.4452 27.5894 14.1177 9.4297 191.2777 17.1859 1.1162 2.0992 10.0036 13.5010 8.5498 29.5742 32.9600 13.2106 14.5289 13.7361 3.0640
temp: 298.150 k
press: 1.00000 atm
elementType: 8 8 7 6 6 6 6 6 6 6 6 6 6 6 6 6 6 6 6 1 1 1 1 1 1 1 1 1 1 1
symmnumber: 1
zpe: 592695.4 jmol-1
zpe.correction: 0.225746 hartree
zpe.thermalcorrener: 0.240389 hartree
zpe.thermalcorrenthalpy: 0.241333 hartree
zpe.thermalcorrgfe: 0.181866 hartree
zpe.sumelectzpe: -820.216358 hartree
zpe.sumelectthermal: -820.201715 hartree
zpe.sumelectthermalent: -820.200771 hartree
zpe.sumelectthermalfe: -820.260238 hartree
dipole: 0.0633 -0.3422 -0.1843
dipole: 0.3938
quadrupole: -80.3103 -108.5187 -115.1066
quadrupole: 4.3931 2.0111 -1.9893
quadrupole: 21.0016 -7.2068 -13.7948 4.3931 2.0111 -1.9893
hfenergy: -820.4421041 hartree
pointgroup: C01 [X(C16H11N1O2)]
dipole: -0.0301823 -0.1088142 0.1060871 debye
polarizability: 293.337881|0.41117|210.648245|12.2655008|-41.1668285|84.1261333 unknown
InChI: InChI=1S/C16H11NO2/c18-16(13-7-4-10-17-11-13)19-15-9-3-6-12-5-1-2-8-14(12)15/h1-11H
charge 0 multiplicity 1
30 atoms
O  0.3555 -0.31792 0.123186
O  1.472267 -2.211606 0.977529
N  3.876213 1.731484 -0.591152
C  -1.959254 0.254684 -0.083681
C  -3.361313 -0.108855 -0.074765
C  -0.99467 -0.777779 0.19766
C  -3.738835 -1.461957 0.214291
C  -1.591259 1.610395 -0.366309
C  -4.339465 0.901761 -0.355638
C  -1.375338 -2.09264 0.48149
C  -2.76627 -2.423457 0.486385
C  -2.569896 2.570859 -0.634064
C  -3.955498 2.215441 -0.630903
C  2.732269 -0.26348 0.25554
C  1.49132 -1.053788 0.49984
C  3.972565 -0.822999 0.658428
C  2.738767 1.013386 -0.36758
C  5.15496 -0.091337 0.433703
C  5.059905 1.17641 -0.188738
H  -4.802086 -1.727431 0.219638
H  -0.533021 1.883171 -0.363825
H  -5.399671 0.622434 -0.348997
H  -0.626428 -2.852346 0.703318
H  -3.056412 -3.455425 0.709623
H  -2.276728 3.604491 -0.847318
H  -4.711794 2.978742 -0.843556
H  3.981478 -1.809027 1.133987
H  1.803965 1.469934 -0.703783
H  6.130416 -0.487332 0.731234
H  5.955511 1.778685 -0.378744
