program: Gaussian 09
title: 000251829
version: EM64L-G09RevD.01
frameworkgroup: C1[X(C12H18O4)]
method: RPBEPBE
basis: SDD
operation: Freq
keyword: #pfreq=noraman
keyword: PBEPBE/SDD
title: #p freq=noraman PBEPBE/SDD
converged: YES YES NO NO
title: Mulliken charges:
elementType: O O O O C C C C C C C C C C C C H H H H H H H H H H H H H H H H H H
charge: -0.289112 -0.274518 -0.222796 -0.246512 0.044231 -0.446896 -0.430001 -0.396532 -0.401556 -0.388459 0.258764 -0.100173 -0.706084 0.278193 -0.210929 -0.472101 0.231599 0.207959 0.210768 0.244341 0.204609 0.206488 0.197633 0.199732 0.208444 0.203801 0.191899 0.260168 0.238303 0.233807 0.237202 0.253021 0.228350 0.246356
chargesum: 0.00000
title: Mulliken charges with hydrogens summed into heavy atoms:
elementType: O O O O C C C C C C C C C C C C
charge: -0.289112 -0.274518 -0.222796 -0.246512 0.275830 -0.028169 0.018950 0.007589 0.006620 0.007240 0.258764 0.159995 0.003229 0.278193 0.042092 0.002604
polarizability: 1.77319824e+02 -1.46081136e+01 1.44709656e+02 8.70075879e+00 1.14876858e+00 1.04276176e+02
1716.lowfreq: -16.3290 -5.0620 -0.0010 -0.0008 -0.0003 10.5844 13.5189 32.3082 49.1167
frequency: 10.1977 32.0423 49.0960 63.2357 80.5187 84.5499 124.5144 144.7290 181.2222 197.2075 215.4174 220.9248 228.4257 296.8077 309.7902 327.0020 334.3910 374.6535 425.2225 433.2730 452.4720 498.0341 505.3309 577.7569 642.5539 661.6786 701.0846 779.2470 785.3713 789.3685 813.7083 828.2626 847.2925 876.9468 895.0936 903.7765 922.8780 932.4641 993.8533 996.9869 1004.1787 1030.5394 1044.8112 1052.9208 1062.3923 1076.4782 1083.9482 1109.2564 1114.7346 1127.1241 1152.0431 1153.7885 1200.1277 1240.4240 1254.0356 1260.8001 1276.3829 1292.3455 1299.6940 1309.8100 1320.4528 1331.8199 1336.8510 1339.2466 1349.9259 1362.5576 1389.3413 1411.4152 1462.7819 1464.8356 1465.5624 1465.7298 1473.0464 1476.7531 1481.3394 1627.2633 1642.4105 1650.5786 2971.5202 2972.4931 2974.3899 2988.1958 2992.0494 3004.3143 3010.0131 3035.1895 3037.4395 3039.9359 3045.8507 3056.2294 3068.2626 3104.3368 3109.0795 3113.5702 3161.0335 3220.2257
redmass: 3.6385 4.3450 5.3562 4.0560 4.2350 6.3193 3.4083 3.0220 2.9233 3.2959 1.6937 1.3324 3.0954 3.9017 3.9118 2.3327 4.0144 4.5751 3.8566 2.9781 2.3738 2.0537 1.9049 3.1046 4.9235 4.6732 4.3001 3.3685 2.1664 1.5727 3.0504 3.3732 2.6883 1.7961 1.7541 2.8295 1.8111 3.0102 1.3949 2.7183 1.0839 2.0101 1.8298 1.1051 1.6146 2.4645 1.3204 2.7155 3.1649 2.8920 2.3712 2.7223 1.5114 1.3056 1.2785 1.3016 1.3646 1.4379 1.2563 1.3120 1.3857 1.3526 1.5155 1.4727 1.5553 1.4838 1.2156 1.2185 1.0859 1.0894 1.0759 1.0619 1.0827 1.0530 1.0976 11.6116 4.6309 10.6877 1.0663 1.0611 1.0628 1.0615 1.0648 1.0348 1.0824 1.0956 1.0982 1.0846 1.1010 1.1025 1.1023 1.0600 1.1011 1.1004 1.0958 1.1157
irintensity: 0.6084 0.8160 4.4301 0.2450 0.8258 2.3287 0.4609 2.4923 2.0997 0.9374 0.6169 0.2714 6.0860 2.8859 3.3649 1.7966 6.3816 20.9896 2.3616 0.5867 2.3003 0.2108 0.4814 1.2481 6.0253 5.9090 1.2591 30.2088 0.8366 0.2776 5.3377 7.6176 8.2914 2.7983 20.5954 6.8283 4.7300 40.6559 42.6651 84.9252 41.3262 24.7039 0.8347 0.0497 60.5249 399.8509 6.8946 9.5465 76.7888 330.8245 9.5060 89.5463 0.3674 0.6236 1.7798 3.1989 13.0635 12.5113 3.8288 0.3650 26.1066 0.3583 0.6600 0.3681 1.1204 6.1715 18.9220 70.0693 2.8107 6.9836 10.8974 16.1405 21.7999 15.6160 2.9601 176.4276 12.7657 125.5760 31.7829 35.3093 32.8175 15.3165 10.3424 15.9338 20.6368 61.1361 60.5065 3.8675 35.2633 43.1998 49.0007 4.7472 19.9999 18.0209 3.6002 8.6990
temp: 298.150 k
press: 1.00000 atm
elementType: 8 8 8 8 6 6 6 6 6 6 6 6 6 6 6 6 1 1 1 1 1 1 1 1 1 1 1 1 1 1 1 1 1 1
symmnumber: 1
zpe: 739527.0 jmol-1
zpe.correction: 0.281671 hartree
zpe.thermalcorrener: 0.298661 hartree
zpe.thermalcorrenthalpy: 0.299605 hartree
zpe.thermalcorrgfe: 0.234486 hartree
zpe.sumelectzpe: -767.718793 hartree
zpe.sumelectthermal: -767.701802 hartree
zpe.sumelectthermalent: -767.700858 hartree
zpe.sumelectthermalfe: -767.765977 hartree
dipole: -0.9989 1.2443 -0.4076
dipole: 1.6469
quadrupole: -76.4202 -90.2812 -99.9927
quadrupole: -1.1233 1.1362 -1.1892
quadrupole: 12.4779 -1.3832 -11.0947 -1.1233 1.1362 -1.1892
hfenergy: -768.0004635 hartree
pointgroup: C01 [X(C12H18O4)]
dipole: -0.3835873 0.4731302 -0.2209737 debye
polarizability: 176.7491801|-14.0121087|144.883889|10.5640221|-4.1064097|104.6725871 unknown
InChI: InChI=1S/C12H18O4/c1-3-11(13)15-9(2)12(14)16-10-7-5-4-6-8-10/h3,9-10H,1,4-8H2,2H3
charge 0 multiplicity 1
34 atoms
O  -0.773191 0.793246 -0.419989
O  2.859154 0.814319 0.01587
O  0.509693 0.113977 1.416314
O  2.448445 -1.325223 -0.837397
C  -2.025161 0.239487 0.212811
C  -3.19558 1.052404 -0.353542
C  -2.137221 -1.25987 -0.112338
C  -4.538899 0.493451 0.182839
C  -3.479235 -1.818001 0.42583
C  -4.683609 -1.016835 -0.125195
C  0.412407 0.636354 0.286714
C  1.558272 1.254051 -0.536133
C  1.552242 2.786608 -0.469977
C  3.180105 -0.541374 -0.186012
C  4.480799 -0.849823 0.4574
C  5.021336 -2.09366 0.386592
H  -1.932045 0.380684 1.307609
H  -3.176407 0.983516 -1.458911
H  -3.078993 2.119112 -0.085941
H  -1.281806 -1.804295 0.325625
H  -2.090921 -1.388084 -1.21168
H  -5.378775 1.061088 -0.260527
H  -4.592165 0.649182 1.280151
H  -3.480854 -1.7681 1.534216
H  -3.569113 -2.887057 0.155959
H  -5.627867 -1.403555 0.303881
H  -4.745651 -1.16069 -1.223555
H  1.460484 0.889737 -1.574668
H  2.392934 3.188995 -1.05945
H  0.606346 3.173738 -0.884214
H  1.657412 3.130458 0.57291
H  4.966296 -0.026641 0.991057
H  5.978235 -2.33023 0.863078
H  4.501134 -2.89457 -0.151827
