program: Gaussian 09
title: 000251854
version: EM64L-G09RevD.01
frameworkgroup: C1[X(C22H19O8P)]
method: RPBEPBE
basis: SDD
operation: Freq
keyword: #p
keyword: freq=noraman
keyword: PBEPBE/SDD
title: #p freq=noraman PBEPBE/SDD
converged: YES YES NO NO
title: Mulliken charges:
elementType: P O O O O O O O O C C C C C C C C C C C C C C C C C C C C C C H H H H H H H H H H H H H H H H H H H
charge: 1.295277 -0.518983 -0.505549 -0.548061 -0.520312 -0.287359 -0.289846 -0.248517 -0.247170 0.244672 0.264960 0.132162 0.126477 -0.305397 -0.328946 0.373941 -0.302472 -0.305433 -0.201305 -0.224143 -0.232976 -0.242305 -0.359101 -0.358016 0.205168 0.200632 -0.195295 -0.205960 -0.245711 -0.500700 -0.500452 0.271141 0.333693 0.276701 0.274492 0.238991 0.239313 0.237214 0.233815 0.250819 0.341112 0.228918 0.233401 0.228440 0.239042 0.253163 0.233903 0.244382 0.239657 0.232522
chargesum: 0.00000
title: Mulliken charges with hydrogens summed into heavy atoms:
elementType: P O O O O O O O O C C C C C C C C C C C C C C C C C C C C C C
charge: 1.295277 -0.518983 -0.505549 -0.548061 -0.520312 -0.287359 -0.289846 -0.248517 -0.247170 0.244672 0.264960 0.132162 0.126477 -0.034256 0.004747 0.373941 -0.025771 -0.030941 0.037686 0.015170 0.004238 -0.008490 -0.108282 -0.016904 0.205168 0.200632 0.033622 0.027441 -0.017270 0.225409 0.216110
polarizability: 3.73454715e+02 -5.55704595e+00 3.44198743e+02 1.60023175e+00 -2.20241960e+01 1.80134201e+02
1716.lowfreq: -4.7787 -0.0010 -0.0009 -0.0009 2.0406 5.0028 8.7504 14.4439 25.6459
frequency: 8.3250 14.3828 25.6184 26.8953 38.7475 49.6287 54.2527 64.8095 65.8662 77.9152 84.7718 93.3306 99.7574 106.9912 112.0133 120.2662 130.4837 153.4286 161.0579 170.4902 198.9648 202.6153 210.2212 232.5739 245.2231 288.7918 310.0147 319.4392 328.8651 346.9209 349.7338 372.7684 397.6158 402.3009 413.8979 435.8067 437.3462 467.8960 483.1139 495.7826 516.5964 522.7357 547.0200 553.4390 563.5840 606.0211 616.3582 639.4199 648.1256 676.6066 678.5729 681.7509 694.6940 695.8795 755.2039 762.0777 765.7772 767.7863 769.0958 783.9076 785.9281 825.7543 834.4789 839.7377 849.5267 890.4953 899.4792 923.8820 924.4535 933.2279 972.4115 977.6766 981.1415 987.0088 999.1600 1001.4579 1010.7174 1019.9978 1037.8269 1040.6128 1046.0330 1049.0943 1063.5490 1078.9403 1113.5624 1114.4588 1119.2839 1132.1804 1146.3952 1147.7450 1149.2885 1168.9748 1171.6292 1175.4135 1181.4755 1184.6526 1192.6240 1240.0089 1241.5976 1270.6233 1294.3263 1317.4421 1379.9214 1383.0687 1383.6299 1421.5594 1421.8356 1427.7862 1429.5345 1440.7056 1451.5040 1452.2799 1463.4992 1464.4091 1470.6623 1472.7810 1484.1919 1575.2341 1580.5114 1594.9705 1602.1168 1603.9811 1605.0057 1626.7739 1631.1049 3002.5618 3004.7486 3103.3692 3107.5760 3129.5294 3130.2695 3136.0494 3141.5272 3144.6442 3146.7242 3146.8266 3150.2865 3159.9466 3161.5557 3163.8181 3173.3749 3179.7131 3184.2994 3186.5138
redmass: 5.0699 5.3427 6.3103 4.8544 5.8479 6.5698 5.8196 5.8394 5.5904 5.7632 6.0112 2.4814 1.8553 2.2811 3.4741 1.3474 5.9957 4.0780 4.3038 5.8955 5.3023 5.9504 5.8811 6.2305 5.7440 7.2982 7.7049 4.9453 5.2546 8.6985 8.1451 10.3245 7.6637 9.3441 2.9792 4.2033 3.9094 5.1827 6.0377 5.6120 5.9972 4.3499 4.9997 4.5680 7.1927 6.8787 7.7675 6.7221 6.9227 4.7133 5.4924 8.4344 3.1191 4.7152 3.1757 3.6124 4.5431 1.7795 4.5452 1.4571 1.5373 7.9765 7.8153 7.7440 1.2541 1.4550 1.3862 7.5027 7.8192 1.3826 1.3814 1.3667 1.3601 5.8761 1.3424 1.3334 1.3043 2.1936 2.7465 6.9543 3.5396 2.6907 15.1387 1.5595 1.2656 1.2661 2.0824 2.0447 1.4973 1.6051 2.5969 1.1091 2.2634 1.1641 1.2899 1.1523 2.2265 3.7348 3.4860 1.4678 1.4742 1.3096 11.0208 9.1714 10.3724 1.2969 1.2787 1.8820 1.9236 2.2349 1.0499 1.0499 1.0530 1.0521 2.4336 2.2173 2.2974 6.7734 6.8248 5.8837 6.8519 6.8395 6.7101 9.7488 9.8689 1.0297 1.0296 1.1043 1.1046 1.0864 1.0915 1.0910 1.0869 1.0896 1.0944 1.1035 1.1047 1.0926 1.0967 1.0958 1.1000 1.0949 1.0968 1.0979
irintensity: 0.4899 0.0273 2.3848 0.5174 0.4160 2.5695 0.7659 0.2713 1.2956 0.0556 0.3183 1.8159 1.1601 1.7324 0.2634 0.2595 4.4617 4.0395 3.0008 0.0984 6.4632 0.1244 8.0383 0.1965 8.2821 6.3289 4.0796 49.6631 11.2212 26.4991 15.6294 19.1150 7.6451 19.2540 0.5327 3.3771 3.5845 26.5195 45.2661 22.2670 7.0303 2.2635 6.2822 11.3880 9.4070 3.2085 5.2710 48.9716 16.0094 9.3711 16.0646 117.6885 60.0337 98.5449 33.1754 27.3038 10.1338 75.8971 21.8470 51.3169 49.2692 204.6601 320.0127 217.8040 3.1910 2.8710 0.7374 2.9115 4.2879 6.3035 4.6710 2.5674 0.3310 4.2200 0.1937 0.4357 3.0772 24.5846 29.5111 320.7544 70.1840 79.3919 90.2879 11.3309 0.2379 0.1824 54.6175 51.2788 55.6627 115.3842 139.3064 16.3540 153.7330 32.7612 10.1927 5.6109 14.3051 323.6531 236.1907 17.0944 50.0730 2.0556 4.8634 1.3791 1.9438 29.6348 20.3353 44.5130 24.4902 12.2040 14.0982 14.4792 17.4617 16.6896 126.1563 62.4094 58.3206 15.8575 6.0936 36.6464 1.8404 45.3832 2.1872 150.0892 504.7490 40.8744 34.3177 25.7855 22.3611 17.3587 87.3192 77.3628 3.2359 3.5342 2.7175 15.2726 17.1332 18.5812 33.2778 16.8689 18.0143 1.9971 9.7270 7.8235
temp: 298.150 k
press: 1.00000 atm
elementType: 15 8 8 8 8 8 8 8 8 6 6 6 6 6 6 6 6 6 6 6 6 6 6 6 6 6 6 6 6 6 6 1 1 1 1 1 1 1 1 1 1 1 1 1 1 1 1 1 1 1
symmnumber: 1
zpe: 957600.2 jmol-1
zpe.correction: 0.364731 hartree
zpe.thermalcorrener: 0.394766 hartree
zpe.thermalcorrenthalpy: 0.395710 hartree
zpe.thermalcorrgfe: 0.298797 hartree
zpe.sumelectzpe: -1790.525540 hartree
zpe.sumelectthermal: -1790.495505 hartree
zpe.sumelectthermalent: -1790.494561 hartree
zpe.sumelectthermalfe: -1790.591474 hartree
dipole: -1.3236 -0.5037 -0.4351
dipole: 1.4815
quadrupole: -136.6052 -159.1704 -187.8336
quadrupole: -1.9227 -0.4542 -7.8627
quadrupole: 24.5979 2.0326 -26.6305 -1.9227 -0.4542 -7.8627
hfenergy: -1790.8902709 hartree
pointgroup: C01 [X(C22H19O8P1)]
dipole: -0.5631917 0.0321326 0.1467466 debye
polarizability: 367.7702852|9.5957133|349.7781896|18.0457553|15.8927727|180.2391844 unknown
InChI: InChI=1S/C22H19O8P/c1-26-21(23)17-12-6-8-14-19(17)29-31(25,28-16-10-4-3-5-11-16)30-20-15-9-7-13-18(20)22(24)27-2/h3-15H,1-2H3
charge 0 multiplicity 1
50 atoms
P  -0.107188 -0.289466 -0.252178
O  -1.402388 -0.248283 0.905976
O  1.072414 0.632969 0.613801
O  0.449211 -1.891232 0.062812
O  -0.420493 0.116104 -1.748752
O  -4.831286 0.964743 -1.432693
O  4.63473 2.605967 1.698755
O  -2.966927 1.788988 -0.326728
O  3.864181 0.705121 0.615565
C  -2.580597 -1.024779 0.749046
C  1.121717 2.049682 0.636948
C  -3.728272 -0.519003 0.073789
C  2.38178 2.653402 0.91867
C  -2.589822 -2.298665 1.355668
C  -0.045124 2.825231 0.469203
C  1.474088 -2.527822 -0.720413
C  -4.884901 -1.346082 0.020795
C  2.424643 4.069683 1.050788
C  -3.753146 -3.093347 1.300393
C  0.037433 4.228132 0.581307
C  -4.903541 -2.61599 0.62823
C  1.27029 4.854987 0.878697
C  1.124161 -3.733863 -1.359445
C  2.778804 -1.996565 -0.76185
C  -3.756365 0.839863 -0.544437
C  3.639319 1.863322 1.040673
C  2.125503 -4.440375 -2.063254
C  3.762372 -2.713569 -1.481279
C  3.44374 -3.930566 -2.128789
C  -4.941496 2.277689 -2.110007
C  5.944069 1.928606 1.829494
H  -1.678595 -2.644869 1.851519
H  -1.01157 2.349759 0.26731
H  -5.76495 -0.966122 -0.503938
H  3.387133 4.532666 1.281847
H  -3.758887 -4.079708 1.776188
H  -0.870375 4.825184 0.444625
H  -5.808193 -3.230376 0.578773
H  1.329414 5.943789 0.973789
H  0.094428 -4.09937 -1.301205
H  3.024056 -1.061059 -0.246152
H  1.871925 -5.381171 -2.563943
H  4.781962 -2.315803 -1.527324
H  4.215754 -4.477301 -2.681082
H  -5.12396 3.075897 -1.370655
H  -4.012373 2.497848 -2.661348
H  -5.794332 2.167618 -2.794105
H  5.833115 0.986292 2.391832
H  6.363762 1.706501 0.833547
H  6.575177 2.643944 2.375336
