program: Gaussian 09
title: 000251827
version: EM64L-G09RevD.01
frameworkgroup: C1[X(C12H14O3)]
method: RPBEPBE
basis: SDD
operation: Freq
keyword: #pfreq=noraman
keyword: PBEPBE/SDD
title: #p freq=noraman PBEPBE/SDD
converged: YES YES NO NO
title: Mulliken charges:
elementType: O O O C C C C C C C C C C C C H H H H H H H H H H H H H H
charge: -0.294886 -0.256996 -0.229539 -0.053227 -0.348597 -0.315809 0.348142 0.297607 -0.358237 -0.372669 -0.352774 -0.333948 0.120712 -0.480019 -0.685461 0.252629 0.223248 0.230881 0.229491 0.221324 0.250530 0.255201 0.243742 0.280713 0.229316 0.229247 0.230486 0.207538 0.231355
chargesum: 0.00000
title: Mulliken charges with hydrogens summed into heavy atoms:
elementType: O O O C C C C C C C C C C C C
charge: -0.294886 -0.256996 -0.229539 0.199402 0.105531 0.135006 0.348142 0.297607 -0.107706 -0.117468 -0.109032 -0.053234 0.120712 -0.021457 -0.016081
polarizability: 2.26931283e+02 1.50100913e+00 1.27738132e+02 -5.58779945e-01 1.58269116e+00 8.19312180e+01
1716.lowfreq: -6.0394 -1.6877 -0.0003 0.0007 0.0008 6.5597 30.1400 42.2933 56.7240
frequency: 30.0568 42.2694 56.7230 77.4924 79.3773 100.9487 135.3042 150.2980 194.3043 216.8627 262.0622 285.5746 300.9268 364.8123 407.8298 415.3707 462.5613 485.7913 487.7241 567.5640 607.9943 628.0940 709.4932 731.9277 749.7434 795.8323 798.8336 811.0610 821.6345 858.9869 898.6166 944.0413 948.4670 963.7846 982.1473 997.7847 1002.2251 1017.2188 1028.8450 1068.1287 1090.3858 1097.4891 1114.0665 1118.2219 1139.8355 1181.2307 1212.5727 1230.5244 1231.1272 1239.6849 1246.1027 1302.1450 1331.0262 1350.5123 1377.2068 1397.1941 1415.6961 1428.5170 1439.7781 1469.0161 1471.8305 1478.1050 1483.9678 1498.2253 1559.8153 1595.1305 1619.0994 2966.7553 2972.3811 2997.3208 3013.4297 3037.5730 3072.7774 3092.8241 3101.8479 3118.2309 3143.1861 3151.3358 3167.2873 3172.0162 3182.9712
redmass: 4.4629 4.5478 3.8985 2.2593 4.4439 2.6447 4.4348 4.1830 1.2229 4.6527 5.3134 5.0692 4.0747 4.3792 2.7980 2.8592 5.1963 3.9833 3.1266 2.0948 5.9985 6.9088 4.2865 3.0517 6.7538 2.7366 1.9087 5.4805 1.3344 1.5191 1.1917 4.4659 1.4182 3.0300 2.4015 1.3356 2.5924 1.5499 1.4255 1.6592 2.6682 1.3688 1.3338 1.2866 1.5374 1.3207 1.3103 3.0226 2.3381 1.5187 1.1878 1.3236 2.0290 1.3896 4.5719 1.2125 1.9673 4.1364 1.1057 1.0392 1.1884 1.0533 1.2063 2.3531 7.0525 8.1151 6.4072 1.0599 1.0557 1.0365 1.0981 1.1073 1.0534 1.1001 1.0999 1.0920 1.0877 1.0880 1.0951 1.0972 1.1192
irintensity: 0.3938 5.5095 0.6044 1.0680 3.1273 0.9202 5.8335 2.2983 0.0697 3.1634 2.0805 1.7622 29.8472 2.4639 0.2262 0.1933 0.0090 9.5406 7.2566 10.0863 16.6523 1.1177 1.4070 1.1158 9.5969 33.8133 50.0443 13.0141 0.3140 39.5077 5.9973 89.6166 3.3077 21.8346 72.4075 0.1375 5.7372 9.4262 0.1074 1.4773 2.2540 4.4353 13.2569 22.6147 2.0833 265.5145 4.2822 345.3526 7.1829 33.1963 0.6158 0.7631 97.1208 10.2281 4.7066 29.1385 2.6087 33.5048 22.1796 11.6312 17.5374 16.4636 8.8799 28.9357 168.3243 114.1009 141.9022 35.8012 28.7187 33.3722 11.3898 25.0202 22.5356 27.9868 31.4772 14.7781 12.2856 0.0914 12.3208 6.4878 28.9675
temp: 298.150 k
press: 1.00000 atm
elementType: 8 8 8 6 6 6 6 6 6 6 6 6 6 6 6 1 1 1 1 1 1 1 1 1 1 1 1 1 1
symmnumber: 1
zpe: 608882.2 jmol-1
zpe.correction: 0.231911 hartree
zpe.thermalcorrener: 0.246848 hartree
zpe.thermalcorrenthalpy: 0.247792 hartree
zpe.thermalcorrgfe: 0.188065 hartree
zpe.sumelectzpe: -690.169699 hartree
zpe.sumelectthermal: -690.154762 hartree
zpe.sumelectthermalent: -690.153818 hartree
zpe.sumelectthermalfe: -690.213545 hartree
dipole: -2.1427 -1.8137 0.3856
dipole: 2.8336
quadrupole: -103.2879 -87.5457 -87.6434
quadrupole: -19.7689 -3.7933 -0.3031
quadrupole: -10.4622 5.2800 5.1823 -19.7689 -3.7933 -0.3031
hfenergy: -690.40161 hartree
pointgroup: C01 [X(C12H14O3)]
dipole: 0.8613221 0.6847556 0.1791009 debye
polarizability: 226.9251499|-0.6491519|127.7442189|-1.9548908|1.1989807|81.9312635 unknown
InChI: InChI=1S/C12H14O3/c1-2-12(13)9-3-5-10(6-4-9)14-7-11-8-15-11/h3-6,11H,2,7-8H2,1H3
charge 0 multiplicity 1
29 atoms
O  5.577854 0.964935 -0.174859
O  2.203036 -0.67332 -0.346356
O  -4.189239 -1.176112 0.018006
C  4.50491 -0.042183 -0.51299
C  5.369016 -0.262165 0.687519
C  3.09965 0.498496 -0.37255
C  0.826337 -0.437852 -0.254635
C  -1.997175 -0.18972 -0.06938
C  0.237661 0.848909 -0.157204
C  0.010275 -1.600288 -0.261418
C  -1.165136 0.959739 -0.065292
C  -1.381023 -1.471716 -0.169438
C  -3.491622 -0.117087 0.027682
C  -4.159011 1.260421 0.139751
C  -5.692127 1.184697 0.233953
H  4.701577 -0.626318 -1.420354
H  4.961288 -0.05746 1.685227
H  6.177661 -1.000322 0.64022
H  2.84467 1.148768 -1.233273
H  3.003815 1.083506 0.563454
H  0.850763 1.754637 -0.148939
H  0.492678 -2.579291 -0.338939
H  -1.605381 1.959419 0.010367
H  -2.030424 -2.35326 -0.172684
H  -3.742039 1.781355 1.026247
H  -3.854711 1.870005 -0.736109
H  -6.004155 0.605078 1.119359
H  -6.127528 2.197771 0.302931
H  -6.116018 0.676756 -0.648895
