program: Gaussian 09
title: 000251828
version: EM64L-G09RevD.01
frameworkgroup: C1[X(C12H17NO2)]
method: RPBEPBE
basis: SDD
operation: Freq
keyword: #p
keyword: freq=noraman
keyword: PBEPBE/SDD
title: #p freq=noraman PBEPBE/SDD
converged: YES YES NO NO
title: Mulliken charges:
elementType: O O N C C C C C C C C C C C C H H H H H H H H H H H H H H H H H
charge: -0.246636 -0.246992 -0.614809 0.240718 -0.394355 -0.416688 -0.346397 -0.041969 -0.724860 0.352454 -0.392409 -0.392959 -0.221462 -0.221273 -0.238872 0.221989 0.218677 0.216172 0.232210 0.249006 0.184011 0.197459 0.271512 0.265917 0.233148 0.191148 0.225873 0.261891 0.262167 0.224649 0.224682 0.225996
chargesum: 0.00000
title: Mulliken charges with hydrogens summed into heavy atoms:
elementType: O O N C C C C C C C C C C C C
charge: -0.246636 -0.246992 -0.077379 0.240718 0.046312 0.031693 0.086620 0.155490 -0.074691 0.352454 -0.130519 -0.130792 0.003187 0.003409 -0.012876
polarizability: 1.81194863e+02 5.79450346e+00 1.30785826e+02 1.23769950e+01 -1.17228045e+01 1.00823892e+02
1716.lowfreq: -11.4140 0.0005 0.0006 0.0007 9.3998 15.0606 29.9911 44.3941 68.2060
frequency: 29.7915 44.3745 68.0931 120.4285 147.2565 180.4751 204.3310 220.6478 240.9236 274.0220 296.6302 297.5097 375.0911 381.7806 403.7223 412.3690 455.7019 475.6468 500.5993 530.1807 609.7695 615.9309 656.0215 661.2778 702.9569 721.7764 744.6820 783.2869 859.6253 861.2250 894.0952 909.6880 923.7189 932.5113 949.4892 960.4056 985.9146 990.6664 994.3123 999.0018 1005.4604 1025.0807 1040.4314 1054.6197 1082.2519 1085.7285 1148.7089 1171.5849 1178.3560 1184.3430 1192.2895 1215.7005 1258.4651 1266.6438 1308.6186 1311.7790 1319.8736 1335.5622 1347.4134 1353.2329 1364.6989 1384.9092 1391.1758 1436.1493 1454.5220 1459.9888 1469.5154 1480.0354 1485.5379 1489.9108 1594.9688 1618.8361 1643.7350 2858.0275 2959.0666 2965.2224 2968.5222 2975.0044 3045.3068 3067.1168 3069.3149 3075.8462 3081.8786 3123.1253 3135.7005 3152.3945 3166.3880 3172.7367 3427.9238 3550.8112
redmass: 3.6668 3.3276 2.2841 4.0997 2.9744 4.1249 1.2104 1.7305 2.3490 4.2284 2.3539 2.9089 3.3055 2.4035 2.8598 2.3805 3.5308 3.1602 4.7533 3.7866 5.6158 6.4219 1.5783 3.5033 2.1431 2.8839 1.6162 1.3364 2.5925 1.2525 5.3000 3.2435 1.9417 2.4509 1.8446 5.2190 1.3813 6.1180 1.4961 1.3250 1.8444 2.8106 3.4782 2.3337 1.6569 1.6536 2.0256 1.0526 2.4969 1.1159 1.1006 1.8494 1.4256 1.3793 1.5079 1.3460 1.2802 1.2280 1.5867 1.7599 1.4444 7.7815 1.2302 2.2070 1.0797 1.0764 1.0872 1.0536 2.4139 1.0572 6.4149 6.1596 1.0946 1.0807 1.0645 1.0648 1.0628 1.0403 1.0941 1.1003 1.0971 1.0996 1.0978 1.0849 1.0895 1.0947 1.0947 1.0988 1.0448 1.0963
irintensity: 0.0210 0.4317 0.5570 3.9267 2.9828 0.2262 31.3350 4.9378 1.1428 5.4635 1.4498 10.3070 2.6577 4.0590 0.0083 9.5914 2.1169 5.6616 3.5913 15.5785 4.7234 0.0960 186.8265 55.1653 39.8604 4.5432 87.8597 11.6126 1.0756 1.5265 74.2771 22.1526 5.9723 0.5659 0.2559 28.2851 0.0206 0.6489 7.6395 1.1610 3.6453 101.3311 115.5434 16.5571 2.1447 0.9789 37.4869 0.0040 1.3834 7.1669 3.9993 6.6082 6.8307 8.9712 11.9851 3.3127 5.1538 1.5655 5.1958 81.7406 0.1616 0.1697 17.3076 11.2769 8.7654 6.4417 24.5080 9.9569 5.5579 8.1071 0.1738 0.9406 40.7812 66.8732 27.9746 75.9712 43.3537 31.9039 0.0151 23.4888 46.3273 62.3984 26.0431 0.0378 17.1727 32.7979 15.5931 8.1055 3.1639 0.4778
temp: 298.150 k
press: 1.00000 atm
elementType: 8 8 7 6 6 6 6 6 6 6 6 6 6 6 6 1 1 1 1 1 1 1 1 1 1 1 1 1 1 1 1 1
symmnumber: 1
zpe: 708012.5 jmol-1
zpe.correction: 0.269668 hartree
zpe.thermalcorrener: 0.284018 hartree
zpe.thermalcorrenthalpy: 0.284962 hartree
zpe.thermalcorrgfe: 0.228169 hartree
zpe.sumelectzpe: -671.501317 hartree
zpe.sumelectthermal: -671.486967 hartree
zpe.sumelectthermalent: -671.486023 hartree
zpe.sumelectthermalfe: -671.542815 hartree
dipole: -2.3590 -0.2165 -0.2517
dipole: 2.3822
quadrupole: -74.4368 -87.1894 -92.5877
quadrupole: 0.7229 -0.7704 -3.2021
quadrupole: 10.3011 -2.4514 -7.8498 0.7229 -0.7704 -3.2021
hfenergy: -671.7709843 hartree
pointgroup: C01 [X(C12H17N1O2)]
dipole: -0.9258767 0.129684 0.0660732 debye
polarizability: 180.852819|-10.4330956|121.5739158|-10.2074531|-18.0698305|110.3778472 unknown
InChI: InChI=1S/C12H17NO2/c1-2-12(13)8-14-11(15-9-12)10-6-4-3-5-7-10/h3-7,11H,2,8-9,13H2,1H3
charge 0 multiplicity 1
32 atoms
O  -0.415882 1.132586 -0.643427
O  -0.572139 -0.676536 0.955608
N  -3.966408 0.878152 0.559881
C  -2.675716 0.335419 0.07332
C  -1.800991 1.550786 -0.350585
C  -1.956381 -0.297046 1.296505
C  -2.800183 -0.66389 -1.119243
C  0.178631 0.511737 0.542063
C  -3.610757 -1.940268 -0.813917
C  1.607841 0.115817 0.235017
C  2.206614 -0.968435 0.920823
C  2.365971 0.860368 -0.700347
C  3.556299 -1.303766 0.672618
C  3.715609 0.522524 -0.945964
C  4.315842 -0.558007 -0.25876
H  -2.167144 2.01104 -1.284685
H  -1.814292 2.303123 0.466897
H  -1.960459 0.440276 2.128013
H  -2.44109 -1.228204 1.63239
H  -1.784269 -0.938471 -1.457197
H  -3.279732 -0.117608 -1.958922
H  0.117311 1.255181 1.378017
H  -4.56864 0.171577 0.998804
H  -4.481958 1.399977 -0.159711
H  -3.0957 -2.586287 -0.080226
H  -4.619208 -1.703895 -0.421609
H  -3.749069 -2.537631 -1.733063
H  1.606071 -1.548269 1.627974
H  1.888456 1.684713 -1.238297
H  4.013616 -2.146544 1.203321
H  4.296849 1.099955 -1.673793
H  5.363306 -0.818374 -0.449302
