program: Gaussian 09
title: 000251820
version: EM64L-G09RevD.01
frameworkgroup: C1[X(C10H16O2)]
method: RPBEPBE
basis: SDD
operation: Freq
keyword: #pfreq=noraman
keyword: PBEPBE/SDD
title: #p freq=noraman PBEPBE/SDD
converged: YES YES NO NO
title: Mulliken charges:
elementType: O O C C C C C C C C C C H H H H H H H H H H H H H H H H
charge: -0.293102 -0.254047 0.011909 -0.427790 -0.430376 0.038100 -0.458635 -0.446609 -0.743221 0.249346 -0.220539 -0.478143 0.194870 0.193546 0.204369 0.203661 0.195959 0.235004 0.209062 0.212863 0.234958 0.204450 0.214201 0.215364 0.208787 0.252063 0.227232 0.246719
chargesum: 0.00000
title: Mulliken charges with hydrogens summed into heavy atoms:
elementType: O O C C C C C C C C C C
charge: -0.293102 -0.254047 0.206778 -0.029875 -0.030755 0.273104 -0.036710 -0.007201 -0.104870 0.249346 0.031524 -0.004192
polarizability: 1.63553030e+02 -4.61591582e+00 9.55276766e+01 -6.18400718e-01 -6.53594666e+00 8.51063239e+01
1716.lowfreq: -12.6007 -0.0007 0.0002 0.0005 3.3611 12.6682 41.9819 53.1080 64.4248
frequency: 41.9747 53.0615 64.4185 126.7171 154.3741 201.1759 216.4513 227.6859 249.4581 274.5715 310.4741 351.3803 409.0940 433.7537 460.2805 478.0897 512.8854 599.8627 645.7774 763.8341 779.1054 785.2668 838.4254 843.7569 886.2005 920.0691 926.8758 962.5909 975.9178 991.4168 1005.2804 1013.9554 1029.4168 1058.1193 1060.8257 1090.4440 1110.5720 1132.9491 1156.1635 1183.7450 1221.1094 1243.0622 1249.9677 1285.4367 1297.1776 1298.3700 1304.5268 1313.2927 1337.2677 1345.4619 1349.5584 1365.5225 1386.2032 1408.6905 1457.7804 1462.0581 1468.5548 1475.0344 1476.6675 1477.7130 1616.3105 1641.4753 2945.2370 2960.6899 2965.3282 2969.6186 2986.5021 2988.4370 3010.2098 3027.1328 3033.6160 3054.3206 3060.7253 3064.0768 3066.2114 3103.5003 3156.7312 3219.6129
redmass: 3.8623 4.3666 4.0095 2.8160 2.9788 1.2732 1.3756 3.4253 3.3465 2.8162 3.2338 3.9346 1.7228 2.6702 3.0656 2.8613 1.9047 3.0696 3.8731 2.6019 3.3383 1.4640 2.1642 3.5528 1.6559 1.4353 2.8283 1.4051 2.7258 1.4002 1.0805 1.6136 2.4619 1.0594 1.5774 2.3437 2.4528 4.0682 2.3024 1.9522 1.3420 1.2768 1.3968 1.3699 1.4069 1.2477 1.2528 1.2728 1.4746 1.6434 1.5635 1.5166 1.2193 1.2209 1.0847 1.0900 1.0839 1.0594 1.0677 1.0763 11.3945 4.5923 1.0802 1.0627 1.0472 1.0535 1.0622 1.0648 1.0831 1.0975 1.0978 1.1019 1.0996 1.1014 1.0992 1.0597 1.0957 1.1158
irintensity: 0.1414 2.4799 2.0987 1.1527 1.9758 0.0707 0.0766 1.9701 2.6900 1.4209 4.0580 8.5677 0.7184 2.8363 0.4741 0.2140 0.0523 1.0777 1.7693 0.6191 22.6649 0.9819 3.4753 5.6151 8.4788 6.1051 22.8524 3.0984 92.0785 41.8331 44.4290 12.4631 16.3408 0.2550 24.0887 24.9094 25.7262 414.0892 0.5355 0.5640 0.7220 0.4008 1.8253 30.7747 0.2119 5.0733 4.7303 0.3512 0.6289 1.7592 0.6182 12.3831 9.8745 73.5526 0.9052 11.0641 12.0651 20.6815 7.1109 4.3631 132.7855 18.3861 5.5344 25.6450 12.9242 95.6974 9.9177 17.4809 15.6517 56.5894 31.9671 25.1823 19.3108 97.1205 43.6554 5.1966 4.6148 9.0424
temp: 298.150 k
press: 1.00000 atm
elementType: 8 8 6 6 6 6 6 6 6 6 6 6 1 1 1 1 1 1 1 1 1 1 1 1 1 1 1 1
symmnumber: 1
zpe: 630549.3 jmol-1
zpe.correction: 0.240164 hartree
zpe.thermalcorrener: 0.252838 hartree
zpe.thermalcorrenthalpy: 0.253782 hartree
zpe.thermalcorrgfe: 0.200772 hartree
zpe.sumelectzpe: -540.157758 hartree
zpe.sumelectthermal: -540.145084 hartree
zpe.sumelectthermalent: -540.144140 hartree
zpe.sumelectthermalfe: -540.197150 hartree
dipole: -0.8027 1.1037 -1.1634
dipole: 1.7933
quadrupole: -63.7481 -74.9232 -74.6304
quadrupole: 2.6301 -3.5815 1.5308
quadrupole: 7.3525 -3.8226 -3.5299 2.6301 -3.5815 1.5308
hfenergy: -540.3979219 hartree
pointgroup: C01 [X(C10H16O2)]
dipole: -0.3306898 0.3268553 -0.5306451 debye
polarizability: 163.7469948|-2.9061463|92.3933373|-0.3889383|-8.0003228|88.0466987 unknown
InChI: InChI=1S/C10H16O2/c1-3-10(11)12-9-6-4-8(2)5-7-9/h3,8-9H,1,4-7H2,2H3
charge 0 multiplicity 1
28 atoms
O  1.207748 0.527085 -0.518038
O  2.257204 -0.800494 1.105094
C  -3.056205 -0.22924 -0.35741
C  -2.497758 1.102416 0.209138
C  -2.093707 -1.395511 -0.013397
C  -0.136906 0.20753 0.071949
C  -1.054932 1.385079 -0.27842
C  -0.650814 -1.123042 -0.505761
C  -4.484969 -0.505511 0.156192
C  2.323728 -0.05373 0.0958
C  3.560418 0.355623 -0.622427
C  4.783924 -0.073082 -0.21832
H  -3.091151 -0.136354 -1.465358
H  -2.514504 1.053141 1.318612
H  -3.157212 1.94342 -0.080278
H  -2.465447 -2.338616 -0.458561
H  -2.089357 -1.544427 1.087242
H  -0.005954 0.111692 1.167698
H  -1.049777 1.526077 -1.377227
H  -0.662373 2.314515 0.174089
H  0.023505 -1.94578 -0.207109
H  -0.637521 -1.057241 -1.611841
H  -5.17573 0.315391 -0.113138
H  -4.891143 -1.442994 -0.267615
H  -4.492647 -0.603993 1.259134
H  3.424658 1.01521 -1.485806
H  5.698033 0.224388 -0.742418
H  4.878392 -0.73325 0.651873
