program: Gaussian 09
title: 000251832
version: EM64L-G09RevD.01
frameworkgroup: C1[X(C13H18O7)]
method: RPBEPBE
basis: SDD
operation: Freq
keyword: #pfreq=noraman
keyword: PBEPBE/SDD
title: #p freq=noraman PBEPBE/SDD
converged: YES YES NO NO
title: Mulliken charges:
elementType: O O O O O O O C C C C C C C C C C C C C H H H H H H H H H H H H H H H H H H
charge: -0.233772 -0.231716 -0.257860 -0.243688 -0.233912 -0.242060 -0.267665 -0.101498 -0.111361 -0.702793 -0.702345 0.286177 0.277819 0.342469 -0.370528 -0.362624 -0.030884 -0.037670 -0.545508 -0.549683 0.264849 0.264874 0.243672 0.236055 0.241655 0.239880 0.240579 0.240047 0.240832 0.228130 0.228573 0.233469 0.253863 0.279187 0.225246 0.220594 0.215746 0.221851
chargesum: 0.00000
title: Mulliken charges with hydrogens summed into heavy atoms:
elementType: O O O O O O O C C C C C C C C C C C C C
charge: -0.233772 -0.231716 -0.257860 -0.243688 -0.233912 -0.242060 -0.267665 0.163351 0.153514 0.018589 0.018162 0.286177 0.277819 0.342469 0.098434 0.099418 0.222978 0.241517 -0.099669 -0.112086
polarizability: 2.10657551e+02 -1.00339218e+01 1.60095162e+02 4.06300326e-01 1.03955699e+01 1.25614954e+02
1716.lowfreq: -6.9264 -5.2150 -0.0007 0.0003 0.0005 1.7328 13.2925 23.1235 26.7050
frequency: 12.8329 22.9600 26.5741 35.5181 42.7763 54.7571 58.4109 66.7672 85.8461 100.4823 107.8517 109.1082 139.6664 181.2939 198.1648 200.9580 214.5359 225.7631 234.0677 263.7013 283.6319 294.5778 311.2501 331.3578 346.0370 375.8284 383.4938 417.4033 427.5166 480.4295 572.7059 578.8500 629.6173 653.9788 669.2923 679.8301 689.7872 703.1738 707.8980 775.4081 794.3641 842.9240 849.0161 878.8231 897.9578 929.2377 937.5458 960.2748 964.7521 967.4290 971.3880 987.9782 1015.7114 1023.0853 1031.6211 1044.9740 1061.0642 1088.2114 1111.1894 1119.1562 1142.4005 1160.0324 1164.6812 1184.5528 1220.2270 1238.7856 1246.3834 1279.8071 1285.6573 1288.9952 1296.8999 1319.2295 1326.8082 1335.9541 1342.9673 1389.7003 1392.1426 1428.4181 1429.6269 1451.8358 1454.3719 1462.8635 1465.9783 1476.7624 1477.4920 1623.7237 1635.3033 1654.5578 1659.5351 1661.7251 3007.3817 3007.7818 3023.7478 3027.3228 3040.1034 3044.3838 3091.6135 3091.6914 3099.5977 3114.0580 3114.1639 3114.5843 3115.6230 3116.9441 3132.0134 3132.8120 3200.0908 3202.0944
redmass: 4.1406 4.9768 4.5257 4.0810 5.3188 4.0679 4.6100 6.1308 5.2096 2.9397 4.4016 4.9591 2.8554 4.2105 2.3224 2.6619 2.0736 2.0691 1.2402 3.0369 4.9648 4.6096 6.6113 3.2435 2.8657 3.3192 3.2699 3.1327 2.5644 3.1809 3.6949 3.0998 4.7703 2.1419 2.1710 7.1530 6.7394 5.0410 4.8623 4.4898 3.4487 3.4726 4.0823 3.0859 3.4359 1.5412 1.8173 1.4410 1.7021 1.5914 1.7277 3.0124 1.2014 2.0558 1.1838 2.1941 2.2696 3.0985 3.1804 2.7394 2.2976 2.0775 2.1335 3.8160 3.3124 1.2309 1.1483 1.4180 1.2464 1.6096 1.2204 1.2600 1.3097 1.2778 1.2856 1.2093 1.2108 1.1580 1.1579 1.1317 1.1294 1.0462 1.0462 1.0527 1.0532 11.7293 10.1309 10.2934 4.6029 4.5339 1.0349 1.0348 1.0612 1.0567 1.0848 1.0852 1.0606 1.0610 1.1075 1.1012 1.1005 1.1012 1.1005 1.1007 1.0968 1.0980 1.1143 1.1144
irintensity: 0.1940 0.7229 0.1025 1.1490 1.1536 0.5657 1.3523 2.1495 1.2186 1.5812 1.3577 1.9515 0.5030 2.8278 1.5595 1.7164 0.7446 2.1592 0.4859 6.8055 3.3388 3.0201 19.7578 2.6433 5.3126 29.7021 17.7159 2.5184 2.3629 1.1667 10.3791 12.5299 12.1060 3.2150 5.9071 7.8911 24.7816 6.9446 8.9367 22.6478 5.4037 13.8427 2.3796 40.8152 53.2105 37.8435 34.8493 61.5366 42.0068 38.1149 17.4630 35.9408 22.3830 136.6885 34.3161 76.5534 333.7149 231.1497 45.1967 86.3138 199.7145 5.2816 1.4217 295.4592 331.5300 45.1154 8.0932 4.6346 2.6362 32.4375 3.3976 8.2323 28.0008 4.4488 5.1702 23.4552 16.3059 15.1571 9.8351 16.3850 22.1313 17.8290 15.6663 8.9589 18.9060 245.0642 182.0207 157.7252 2.9423 1.8593 12.9353 11.6853 22.2386 30.2909 3.7693 4.7587 5.6037 8.1975 8.9180 14.8860 5.7657 18.3224 11.5630 13.6095 4.7802 6.9358 18.2292 19.6823
temp: 298.150 k
press: 1.00000 atm
elementType: 8 8 8 8 8 8 8 6 6 6 6 6 6 6 6 6 6 6 6 6 1 1 1 1 1 1 1 1 1 1 1 1 1 1 1 1 1 1
symmnumber: 1
zpe: 773650.3 jmol-1
zpe.correction: 0.294668 hartree
zpe.thermalcorrener: 0.317633 hartree
zpe.thermalcorrenthalpy: 0.318577 hartree
zpe.thermalcorrgfe: 0.238017 hartree
zpe.sumelectzpe: -1031.152352 hartree
zpe.sumelectthermal: -1031.129387 hartree
zpe.sumelectthermalent: -1031.128442 hartree
zpe.sumelectthermalfe: -1031.209003 hartree
dipole: -3.3660 -0.6058 -0.5274
dipole: 3.4605
quadrupole: -99.8043 -109.8987 -119.1500
quadrupole: -5.9125 -4.8301 -3.5786
quadrupole: 9.8133 -0.2810 -9.5323 -5.9125 -4.8301 -3.5786
hfenergy: -1031.4470196 hartree
pointgroup: C01 [X(C13H18O7)]
dipole: 1.3052309 -0.3637204 -0.1330633 debye
polarizability: 192.8532718|-25.1950663|180.450743|-2.0000001|-3.6678459|123.0636527 unknown
InChI: InChI=1S/C13H18O7/c1-5-7-17-11(14)9(3)19-13(16)20-10(4)12(15)18-8-6-2/h5-6,9-10H,1-2,7-8H2,3-4H3
charge 0 multiplicity 1
38 atoms
O  0.837995 1.895284 0.062224
O  -1.308114 2.494866 0.170135
O  2.676275 -1.099736 1.093065
O  -2.540305 0.419995 -0.91224
O  1.018922 -0.900286 -0.541418
O  -4.37282 0.487066 0.543184
O  -0.530695 0.848137 1.658338
C  1.988346 1.114109 0.575905
C  -2.696461 2.265671 0.653799
C  3.226998 1.671475 -0.135885
C  -3.512825 3.48216 0.203428
C  1.795727 -0.385938 0.288654
C  -3.295802 0.954794 0.111442
C  -0.360195 1.654138 0.717129
C  2.656508 -2.600695 0.935826
C  -2.964479 -0.918286 -1.461314
C  3.486378 -3.036857 -0.24319
C  -2.203428 -2.015921 -0.762653
C  4.622066 -3.768635 -0.127709
C  -2.81051 -3.069683 -0.163586
H  2.055023 1.240297 1.671314
H  -2.683685 2.170492 1.755065
H  3.336792 2.743808 0.0948
H  4.127611 1.135319 0.206786
H  3.12899 1.555534 -1.228236
H  -3.100064 4.399672 0.654082
H  -4.560371 3.361961 0.526559
H  -3.483201 3.583903 -0.894268
H  1.599899 -2.90442 0.821777
H  3.065074 -2.964123 1.890742
H  -2.689926 -0.838763 -2.526532
H  -4.056639 -1.026746 -1.344672
H  3.107339 -2.746652 -1.231783
H  -1.110325 -1.914644 -0.773938
H  5.187294 -4.092142 -1.008582
H  5.016078 -4.072051 0.850531
H  -2.229924 -3.867421 0.313289
H  -3.902948 -3.16278 -0.125566
