program: Gaussian 09
title: 000251846
version: EM64L-G09RevD.01
frameworkgroup: C1[X(C20H17O6P)]
method: RPBEPBE
basis: SDD
operation: Freq
keyword: #p
keyword: freq=noraman
keyword: PBEPBE/SDD
title: #p freq=noraman PBEPBE/SDD
converged: YES YES NO NO
title: Mulliken charges:
elementType: P O O O O O O C C C C C C C C C C C C C C C C C C C C H H H H H H H H H H H H H H H H H
charge: 1.299308 -0.508389 -0.549858 -0.526335 -0.540306 -0.290716 -0.242061 0.248481 0.115215 -0.311893 0.379991 0.367475 -0.298622 -0.201458 -0.232597 0.203863 -0.333992 -0.336058 -0.368669 -0.357218 -0.200560 -0.210998 -0.194036 -0.195787 -0.245726 -0.247597 -0.500288 0.289432 0.277820 0.238167 0.237115 0.290586 0.323048 0.260097 0.255907 0.232107 0.230195 0.232392 0.229978 0.231536 0.228396 0.233999 0.243835 0.244218
chargesum: 0.00000
title: Mulliken charges with hydrogens summed into heavy atoms:
elementType: P O O O O O O C C C C C C C C C C C C C C C C C C C C
charge: 1.299308 -0.508389 -0.549858 -0.526335 -0.540306 -0.290716 -0.242061 0.248481 0.115215 -0.022462 0.379991 0.367475 -0.020802 0.036709 0.004518 0.203863 -0.043406 -0.013009 -0.108572 -0.101311 0.031548 0.019197 0.038356 0.034191 -0.014190 -0.019201 0.221765
polarizability: 3.30302945e+02 -8.18821390e+00 3.01322077e+02 -1.80173066e+01 1.26228055e+01 1.60517521e+02
1716.lowfreq: -4.0326 0.0003 0.0006 0.0006 5.1051 5.9693 9.5617 18.1187 22.6216
frequency: 7.7154 18.0345 22.5390 25.4816 32.0651 53.1591 61.5251 73.6620 78.6087 92.3815 100.5680 113.1523 129.4079 155.8357 163.4298 179.3000 198.2806 213.5646 236.4543 255.7098 295.1346 306.4064 322.3236 330.3579 378.7269 383.7400 410.0977 412.9178 433.3337 436.4998 479.5897 484.0261 492.8603 508.8329 542.0170 545.0608 556.5502 604.0820 608.2502 622.2896 646.6549 675.0413 682.1235 691.5290 693.0518 697.4787 759.3877 763.6568 764.1120 768.2237 784.2072 824.8703 835.9367 837.3990 840.2578 844.9770 892.3679 917.5229 924.0811 926.0853 972.5468 974.6762 977.0030 986.1873 986.7995 991.8936 996.9919 998.9772 1021.0404 1021.5781 1038.1568 1044.8565 1055.6330 1078.0622 1080.7160 1114.8751 1120.7735 1147.1845 1150.2048 1158.8125 1169.1640 1169.9745 1174.6210 1181.2276 1186.9326 1191.8022 1239.0684 1271.2778 1311.5878 1321.0241 1381.6200 1381.7968 1383.9351 1422.4184 1428.5048 1441.1059 1442.3276 1452.3221 1464.4869 1469.9512 1472.7674 1476.2243 1579.4038 1594.3784 1596.9674 1603.2741 1603.9504 1604.2400 1630.7796 3004.3623 3106.0819 3131.2815 3132.8085 3140.0264 3141.5084 3143.1182 3149.1602 3149.6360 3157.3682 3158.9455 3163.6004 3167.3549 3173.4632 3176.0962 3177.2181 3185.7666
redmass: 5.2696 5.9994 3.8285 5.6388 5.2012 5.7990 5.1749 7.1477 5.5922 4.9469 2.5152 1.5773 4.4154 5.5605 5.4162 5.3535 5.5287 5.5602 6.5174 6.5604 7.3775 7.5875 5.6986 6.9428 8.2327 10.4023 2.9244 2.9734 7.8409 4.1332 4.5453 3.9190 5.6812 5.3613 5.7292 5.9685 5.0783 6.9450 6.6017 7.8354 7.0343 4.8157 8.9477 2.3456 2.6430 5.9942 3.3920 1.5010 1.5376 5.4183 1.5269 7.5435 6.7781 2.0517 2.4353 1.2475 1.4251 1.4066 7.9482 1.3864 1.3672 1.3762 1.3615 5.4530 5.9799 1.3527 1.3110 1.3389 2.2025 2.1675 3.0380 3.6437 11.8788 1.5822 1.5530 1.2751 2.0735 1.4712 2.9563 2.2643 1.1678 1.1635 1.1453 1.4375 1.2022 1.7586 3.7985 1.4646 1.3189 1.3054 9.3622 10.7670 9.1959 1.3069 1.8597 2.2523 2.2589 1.0496 1.0537 2.2500 2.2876 2.2837 6.8567 6.1280 5.9652 6.8376 6.7296 6.8332 9.9405 1.0296 1.1045 1.0852 1.0852 1.0900 1.0867 1.0896 1.1043 1.0949 1.0938 1.0918 1.0974 1.0976 1.0964 1.0993 1.0995 1.0973
irintensity: 0.1496 0.5323 0.0420 1.8242 0.2414 1.7025 1.0062 0.3937 0.1494 1.4223 2.6905 0.3890 1.7576 2.0339 1.4984 4.7969 3.8607 3.6501 9.1358 2.0467 10.6847 1.4677 45.4248 8.6450 28.7690 21.1346 0.1935 0.3924 30.8280 3.4135 32.1734 17.8395 38.3138 7.3457 19.1750 8.3652 7.9180 3.5490 8.9000 11.5670 21.2641 14.6731 110.5409 6.0614 38.5676 121.5921 25.5337 95.5643 78.7314 20.8005 49.9872 287.4060 134.5901 181.1046 232.7624 1.2650 3.4322 13.4227 1.4247 6.6694 0.1519 4.5825 0.2847 1.4185 3.4156 1.1006 1.0888 0.2800 33.7345 24.9520 48.2176 210.1807 84.7040 4.5890 14.5707 0.8426 52.1850 76.7614 242.9518 181.5412 41.5744 34.7985 7.5682 35.5675 9.8769 4.5347 247.0274 14.0697 0.3253 4.7639 1.6397 3.1170 0.5632 24.1745 40.0053 8.9874 17.0303 14.8355 22.7703 174.5783 111.0508 16.9933 16.0596 63.2127 37.3323 0.8532 32.4342 11.0726 330.7376 35.3554 24.2110 7.1199 0.1635 66.4781 3.1895 15.3613 19.5086 1.3437 14.7564 13.8557 33.1782 15.2490 3.7966 14.9040 8.6751 8.7450
temp: 298.150 k
press: 1.00000 atm
elementType: 15 8 8 8 8 8 8 6 6 6 6 6 6 6 6 6 6 6 6 6 6 6 6 6 6 6 6 1 1 1 1 1 1 1 1 1 1 1 1 1 1 1 1 1
symmnumber: 1
zpe: 850274.7 jmol-1
zpe.correction: 0.323853 hartree
zpe.thermalcorrener: 0.349162 hartree
zpe.thermalcorrenthalpy: 0.350106 hartree
zpe.thermalcorrgfe: 0.263459 hartree
zpe.sumelectzpe: -1562.963371 hartree
zpe.sumelectthermal: -1562.938062 hartree
zpe.sumelectthermalent: -1562.937117 hartree
zpe.sumelectthermalfe: -1563.023764 hartree
dipole: -1.1380 -1.3506 -0.2920
dipole: 1.7901
quadrupole: -123.2461 -140.0590 -168.3840
quadrupole: -2.1790 -4.9289 2.2976
quadrupole: 20.6503 3.8374 -24.4877 -2.1790 -4.9289 2.2976
hfenergy: -1563.2872232 hartree
pointgroup: C01 [X(C20H17O6P1)]
dipole: -0.4167105 -0.5669253 -0.0307974 debye
polarizability: 329.9387964|-8.93725|301.1107658|-22.9005225|-6.166329|161.0929811 unknown
InChI: InChI=1S/C20H17O6P/c1-23-20(21)18-14-8-9-15-19(18)26-27(22,24-16-10-4-2-5-11-16)25-17-12-6-3-7-13-17/h2-15H,1H3
charge 0 multiplicity 1
44 atoms
P  0.556141 -0.033253 -0.003647
O  -0.850643 -0.668814 -0.788711
O  1.693408 -1.243591 -0.50855
O  0.984802 1.225382 -1.09101
O  0.463582 0.275644 1.546687
O  -4.974307 -0.421758 0.28907
O  -3.021858 0.827835 0.201148
C  -1.569065 -1.788004 -0.294273
C  -2.927379 -1.632225 0.103274
C  -0.955946 -3.059536 -0.324993
C  3.073824 -1.213921 -0.120276
C  0.593402 2.595634 -0.916784
C  -3.656646 -2.80316 0.452158
C  -1.694913 -4.200353 0.048203
C  -3.051006 -4.073522 0.432016
C  -3.580825 -0.293617 0.190188
C  3.484111 -0.885078 1.190453
C  -0.685794 2.958002 -0.449968
C  3.992501 -1.608706 -1.114222
C  1.556414 3.548717 -1.304199
C  4.86249 -0.950382 1.497834
C  -0.995936 4.334878 -0.367707
C  5.363808 -1.681044 -0.783266
C  1.220756 4.918525 -1.22567
C  5.803079 -1.349486 0.520273
C  -0.052731 5.315414 -0.75385
C  -5.718456 0.851653 0.421723
H  0.087559 -3.132581 -0.646077
H  -4.702926 -2.688155 0.745323
H  -1.215004 -5.184599 0.028858
H  -3.629726 -4.958777 0.71397
H  2.749904 -0.584015 1.944692
H  -1.424942 2.20002 -0.168651
H  3.627465 -1.846645 -2.117549
H  2.535552 3.213031 -1.658115
H  5.196319 -0.693395 2.509007
H  -1.984189 4.63551 -0.003216
H  6.08637 -1.988989 -1.546802
H  1.957383 5.671095 -1.527378
H  6.86787 -1.401296 0.770905
H  -0.306695 6.378793 -0.687999
H  -6.77403 0.552887 0.485612
H  -5.399824 1.388854 1.33098
H  -5.538701 1.491627 -0.458359
