program: Gaussian 09
title: 000251774
version: EM64L-G09RevD.01
frameworkgroup: C1[X(C10H13N5)]
method: RPBEPBE
basis: SDD
operation: Freq
keyword: #pfreq=noraman
keyword: PBEPBE/SDD
title: #p freq=noraman PBEPBE/SDD
converged: NO NO NO NO
title: Mulliken charges:
elementType: N N N N N C C C C C C C C C C H H H H H H H H H H H H H
charge: -0.119065 -0.013210 0.048690 -0.068520 0.008966 -0.090827 0.190989 -0.106657 0.098220 0.103826 -0.598744 -0.593914 -0.773565 -0.765657 -0.412171 0.257874 0.257938 0.198695 0.253110 0.253301 0.200172 0.246562 0.230774 0.231067 0.225686 0.266152 0.226360 0.243949
chargesum: 0.00000
title: Mulliken charges with hydrogens summed into heavy atoms:
elementType: N N N N N C C C C C C C C C C
charge: -0.119065 -0.013210 0.048690 -0.068520 0.008966 -0.090827 0.190989 -0.106657 0.098220 0.103826 0.115763 0.112669 -0.065162 -0.047460 -0.168222
polarizability: 2.21017294e+02 4.72730939e+00 1.63817880e+02 8.38904948e-03 8.73831899e-03 7.41618232e+01
1716.lowfreq: -50.3289 -6.1234 -0.0009 -0.0007 -0.0002 8.2445 12.8346 42.8184 64.7335
frequency: -50.1228 42.6598 64.7240 94.2906 97.3183 137.0336 145.3034 170.9883 175.4304 255.6232 273.4151 287.3679 297.7922 346.3007 359.3585 391.4365 453.5857 471.6379 509.6558 543.8249 547.5001 581.3179 641.5026 641.8336 682.2710 714.0454 770.9813 823.6570 832.1304 902.3414 948.3373 984.8323 1011.0497 1020.0396 1047.8610 1051.7479 1055.6551 1095.5624 1119.2247 1137.3691 1157.8675 1188.5468 1217.0866 1263.3310 1281.7688 1328.1787 1348.1895 1381.4248 1388.3759 1396.7089 1410.8403 1423.9810 1433.9567 1441.2232 1443.3380 1448.8529 1457.7417 1461.0474 1461.3677 1470.2174 1471.6511 1483.4591 1486.4053 1535.9316 1545.1978 2973.9620 2975.8089 2996.7816 3004.6761 3047.1197 3049.8858 3082.6304 3093.1140 3108.4184 3109.4297 3120.5741 3122.0651 3152.3876
redmass: 1.7014 1.8835 1.5236 1.3248 1.2071 3.9687 1.9319 3.5883 1.2777 3.5526 5.1803 2.4907 3.3793 4.0012 3.8748 3.9872 6.8280 5.0530 5.2814 3.9815 4.0397 5.1769 5.4467 6.0389 7.9896 5.5408 4.5538 6.9409 10.9853 4.4034 1.4642 1.6842 1.9762 1.4137 2.7030 1.6796 1.6995 1.2349 1.3509 5.9322 3.1884 2.7034 7.0899 4.8390 6.0767 3.8375 5.2545 2.6344 1.4901 1.2520 2.4473 1.5098 1.3469 1.2098 1.0408 1.5946 1.0480 1.0450 1.2316 1.0464 1.2872 1.4244 3.3215 3.4103 4.0936 1.0382 1.0390 1.0324 1.0340 1.0965 1.0964 1.1002 1.1013 1.1031 1.0984 1.1015 1.0978 1.0915
irintensity: 0.0111 0.1373 1.3152 0.1325 0.0657 0.8042 3.4835 2.7066 0.0499 4.3109 0.0154 0.5693 0.4856 2.9737 1.9621 0.4563 5.3285 3.7671 5.6962 12.1877 0.7682 1.1602 1.0826 1.3744 3.7906 2.5719 4.5507 3.1526 2.9168 7.1674 11.7258 31.1719 6.2652 5.8987 7.0872 16.6833 0.0110 0.0057 0.9946 8.2274 19.9723 15.0144 20.3734 2.5380 106.1445 119.9509 12.8501 44.4337 21.4904 30.4362 28.4585 29.4038 5.7356 4.1249 0.8655 85.5728 0.0958 24.1568 16.2262 35.5690 57.3140 27.8993 80.7076 287.7382 164.1296 27.2339 12.4885 37.7286 64.6487 26.8700 6.5592 13.7337 24.1066 16.2887 9.6034 43.4459 6.1108 28.8324
temp: 298.150 k
press: 1.00000 atm
elementType: 7 7 7 7 7 6 6 6 6 6 6 6 6 6 6 1 1 1 1 1 1 1 1 1 1 1 1 1
symmnumber: 1
zpe: 583123.0 jmol-1
zpe.correction: 0.222100 hartree
zpe.thermalcorrener: 0.236010 hartree
zpe.thermalcorrenthalpy: 0.236955 hartree
zpe.thermalcorrgfe: 0.181182 hartree
zpe.sumelectzpe: -661.516283 hartree
zpe.sumelectthermal: -661.502372 hartree
zpe.sumelectthermalent: -661.501428 hartree
zpe.sumelectthermalfe: -661.557200 hartree
dipole: 0.1758 -5.9150 0.0058
dipole: 5.9176
quadrupole: -72.6570 -95.0275 -88.7396
quadrupole: 1.8645 0.0230 -0.0070
quadrupole: 12.8177 -9.5528 -3.2649 1.8645 0.0230 -0.0070
hfenergy: -661.7383829 hartree
pointgroup: C01 [X(C10H13N5)]
dipole: -0.1147984 2.2135496 0.7123484 debye
polarizability: 215.0456318|-3.4841335|155.0020432|28.844253|26.0683125|88.9493216 unknown
InChI: InChI=1S/C10H13N5/c1-6-7(2)14-9-8(13-6)10(15(3)4)12-5-11-9/h5H,1-4H3
charge 0 multiplicity 1
28 atoms
N  -2.379686 1.20534 -0.29775
N  0.565139 1.151318 0.308789
N  1.910528 -1.307737 -0.216375
N  -2.177363 -1.008837 -0.989884
N  -0.094935 -2.297976 -0.974595
C  -0.126282 0.067745 -0.197401
C  -1.562341 0.114593 -0.486807
C  0.55138 -1.184522 -0.467184
C  1.88772 1.01781 0.547574
C  2.568036 -0.238206 0.278465
C  -3.811352 1.043288 -0.650309
C  -1.922336 2.508405 0.230392
C  2.628885 2.212283 1.102464
C  4.047375 -0.394987 0.544721
C  -1.416971 -2.125561 -1.199178
H  -4.270317 0.227826 -0.065682
H  -3.926781 0.776633 -1.7147
H  -4.331247 1.991797 -0.442863
H  -1.142923 2.952038 -0.41013
H  -1.487507 2.405331 1.237784
H  -2.792123 3.183584 0.272552
H  1.926942 3.050674 1.234027
H  3.096905 1.981688 2.079019
H  3.445514 2.533412 0.427274
H  4.287914 -0.208933 1.609287
H  4.35349 -1.41815 0.280149
H  4.643544 0.325474 -0.047995
H  -1.957408 -2.988733 -1.601241
