program: Gaussian 09
title: 000019507
version: EM64L-G09RevD.01
frameworkgroup: C1[X(C7H11NO)]
method: RPBEPBE
basis: SDD
operation: Freq
keyword: #p
keyword: freq=noraman
keyword: PBEPBE/SDD
title: #p freq=noraman PBEPBE/SDD
converged: NO YES NO NO
title: Mulliken charges:
elementType: O N C C C C C C C H H H H H H H H H H H
charge: -0.189483 -0.008429 -0.233651 -0.459004 -0.458982 -0.454092 -0.454116 -0.512944 0.129629 0.261306 0.223172 0.234263 0.234292 0.223158 0.242790 0.229837 0.229886 0.242772 0.259848 0.259748
chargesum: 0.00000
title: Mulliken charges with hydrogens summed into heavy atoms:
elementType: O N C C C C C C C
charge: -0.189483 -0.008429 0.027655 -0.001569 -0.001532 0.018535 0.018543 0.006652 0.129629
polarizability: 8.24539546e+01 2.05125876e+00 7.33497924e+01 1.94115235e-03 3.11023378e-04 7.23793069e+01
1716.lowfreq: -18.8834 0.0001 0.0003 0.0006 9.6859 20.8677 75.9406 148.7965 271.5801
frequency: 75.8785 148.7350 271.5646 366.6135 369.8581 422.1472 502.3530 519.9098 559.5276 580.2940 699.8936 765.7009 795.5751 811.1111 846.3529 866.0850 915.3894 947.4628 981.2459 982.5248 1045.0678 1052.3106 1068.1978 1084.1760 1142.8277 1168.3126 1203.9920 1220.8674 1235.9513 1266.9924 1279.9318 1289.5330 1306.7632 1312.0170 1324.8358 1327.8560 1332.0749 1414.8404 1460.9249 1469.7409 1470.0637 1483.0307 1646.9212 2988.7220 2989.1630 2990.7725 3005.8258 3008.8459 3046.0520 3048.1605 3050.6637 3065.5343 3072.6364 3078.0110
redmass: 3.1328 2.1841 1.8146 2.0079 2.6122 5.0869 4.0245 4.5751 7.1628 2.3473 5.2474 3.5797 1.2120 1.7417 1.9942 3.1531 1.8352 4.4125 2.9745 2.2099 3.0191 3.4591 1.8341 1.8667 1.0626 2.3080 1.3909 1.2007 1.5675 1.2820 1.4283 1.4458 1.2538 1.3962 1.2682 1.5770 1.3065 1.0754 1.0769 1.0833 1.0807 1.0890 10.5539 1.0598 1.0598 1.0596 1.0606 1.0625 1.1044 1.1040 1.1022 1.0879 1.1061 1.1061
irintensity: 4.3917 0.9052 0.0527 1.4332 2.4552 14.5153 3.0763 0.1279 16.6533 0.0327 9.8361 13.8309 3.0091 10.5150 12.6799 0.5674 4.2817 0.3075 6.2259 8.4624 10.2529 9.6166 37.8221 1.5416 0.0028 8.7193 4.1304 0.0254 13.6689 2.5744 2.0227 1.7623 0.3244 1.3590 0.7334 2.4452 3.9966 23.1694 0.9860 12.4357 17.1980 4.8786 181.1113 26.4123 49.6134 6.7697 81.9457 47.5698 5.4419 1.1315 3.7043 23.4971 33.6161 66.0597
temp: 298.150 k
press: 1.00000 atm
elementType: 8 7 6 6 6 6 6 6 6 1 1 1 1 1 1 1 1 1 1 1
symmnumber: 1
zpe: 450871.6 jmol-1
zpe.correction: 0.171728 hartree
zpe.thermalcorrener: 0.179185 hartree
zpe.thermalcorrenthalpy: 0.180129 hartree
zpe.thermalcorrgfe: 0.139810 hartree
zpe.sumelectzpe: -402.591304 hartree
zpe.sumelectthermal: -402.583848 hartree
zpe.sumelectthermalent: -402.582903 hartree
zpe.sumelectthermalfe: -402.623222 hartree
dipole: 2.8849 1.1791 0.0018
dipole: 3.1166
quadrupole: -65.4778 -54.4914 -50.2449
quadrupole: 3.6209 0.0055 -0.0057
quadrupole: -8.7397 2.2466 6.4931 3.6209 0.0055 -0.0057
hfenergy: -402.7630321 hartree
pointgroup: C01 [X(C7H11N1O1)]
dipole: -1.1076976 0.5257846 0.0008419 debye
dipolederiv: -1.0820174 0.0394608 0.0002639 0.0101895 -0.4756712 -0.0001332 0.0009249 -0.0001361 -0.2724144 -0.4719078 -0.0854231 -0.0000822 -0.0934917 -0.5744451 -0.0000254 0.0001071 -0.0001201 -0.4155091 -0.2178944 0.1966772 0.0002274 0.2089954 -0.1076691 -0.0002089 0.000091 -0.0000231 0.0252329 0.0515936 -0.1059366 0.037592 -0.0152227 -0.0405866 -0.045476 0.0259597 0.0418526 0.0275094 0.0515564 -0.1059233 -0.0376531 -0.0150591 -0.0406782 0.0454918 -0.0258813 -0.04181 0.0277249 0.2494791 0.0433434 -0.0827306 0.0725075 0.2859469 0.0463947 -0.0755801 0.0646103 0.3169949 0.2496694 0.043139 0.0829149 0.072288 0.2859532 -0.0465011 0.0757055 -0.0646302 0.3165992 0.2492065 -0.153364 -0.000133 -0.2717667 -0.0484972 -0.0000757 -0.0005366 -0.0003968 0.1180001 1.1272044 -0.006297 -0.000409 -0.1435659 0.7925009 0.0005626 -0.000769 0.0004665 -0.0054597 -0.0229471 -0.1115638 0.0000022 -0.0844052 -0.0652323 -0.0000274 0.0000054 0.00004 0.0541062 -0.0321462 0.1281199 0.0312037 0.0872129 -0.1158867 -0.0381812 0.0149273 0.0123811 0.0750498 0.0082463 -0.0471356 -0.1205049 -0.0102551 0.0550861 0.0010919 -0.080689 -0.0312701 -0.1183833 0.0084214 -0.0471567 0.1202897 -0.0102709 0.0551043 -0.0010702 0.0805438 0.0313966 -0.1185893 -0.032115 0.1281057 -0.0309986 0.0871714 -0.1159241 0.037974 -0.0148174 -0.0125894 0.0751047 0.0770285 0.016034 -0.0704502 -0.0236977 -0.0312977 0.1113296 -0.005757 0.0889464 -0.1083965 -0.1727896 0.0240333 0.042438 0.0599363 0.0274372 -0.0284283 -0.0263117 -0.012819 0.0811607 -0.1727736 0.024147 -0.0419682 0.0600143 0.0273828 0.028282 0.0267988 0.0127256 0.0812489 0.0771346 0.0157981 0.0701284 -0.0239333 -0.0310991 -0.1112677 0.0053949 -0.0889157 -0.1087413 0.0275715 0.0017762 0.0394389 0.0165076 0.0590397 -0.0629166 0.0648059 -0.1291523 -0.0258458 0.0274796 0.0021655 -0.0395693 0.0168453 0.0585361 0.0631851 -0.0649223 0.1294436 -0.0253922 unknown
polarizability: 82.2003801|-2.5400555|73.6033584|-0.0082606|0.0032077|72.3793155 unknown
InChI: InChI=1S/C7H11NO/c9-7-5-8-3-1-6(7)2-4-8/h6H,1-5H2
charge 0 multiplicity 1
20 atoms
O  2.559133 -0.194143 -0.001881
N  -1.036416 -1.048297 0.000128
C  0.451967 1.108274 0.000202
C  -0.458782 1.075404 1.268527
C  -0.460171 1.07633 -1.267154
C  -1.333051 -0.234397 1.220856
C  -1.334836 -0.233171 -1.219317
C  0.406328 -1.420799 -0.001224
C  1.302037 -0.162695 -0.000407
H  1.106909 1.995745 0.000163
H  -1.094229 1.981318 1.266384
H  0.160828 1.111632 2.182996
H  0.158467 1.112877 -2.182272
H  -1.095359 1.982418 -1.263873
H  -1.144773 -0.868754 2.105215
H  -2.410712 0.0077 1.209744
H  -2.412406 0.009252 -1.206209
H  -1.148222 -0.866757 -2.104581
H  0.635963 -2.038627 -0.890564
H  0.637224 -2.040509 0.886468
