program: Gaussian 09
title: 000251763
version: EM64L-G09RevD.01
frameworkgroup: C1[X(C3H3N3O2S)]
method: RPBEPBE
basis: SDD
operation: Freq
keyword: #p
keyword: freq=noraman
keyword: PBEPBE/SDD
title: #p freq=noraman PBEPBE/SDD
converged: NO YES NO NO
title: Mulliken charges:
elementType: S O O N N N C C C H H H
charge: 0.516447 -0.376459 -0.282419 -0.334627 -0.416626 -0.623407 -0.013223 0.211133 0.216620 0.378098 0.333952 0.390511
chargesum: 0.00000
title: Mulliken charges with hydrogens summed into heavy atoms:
elementType: S O O N N N C C C
charge: 0.516447 0.014051 -0.282419 -0.334627 -0.416626 0.088644 -0.013223 0.211133 0.216620
polarizability: 1.11857827e+02 -4.96980136e+00 8.79069229e+01 -9.41221188e-03 -4.77734791e-03 3.11928450e+01
1716.lowfreq: -9.7709 -0.0022 -0.0014 0.0007 4.5086 6.6684 80.6559 160.6787 208.9346
frequency: 80.5988 160.6776 208.9341 254.2688 326.9446 392.8217 448.1829 449.7001 509.4414 561.3585 589.3374 627.0176 644.4990 650.6312 669.0624 709.1289 779.3955 784.0999 1016.5205 1076.8847 1162.2698 1320.8585 1342.7677 1433.9290 1502.4027 1595.1762 1613.7452 3468.8651 3514.1056 3667.5652
redmass: 10.8997 10.0296 7.5164 7.2568 4.5674 9.9837 8.0244 5.2880 1.1900 10.2895 1.3924 5.3149 1.1512 6.9970 3.9030 13.3146 11.2856 6.3691 4.5231 2.1539 1.9961 6.6519 3.1909 7.5773 2.9961 3.0214 2.2557 1.0511 1.0641 1.0996
irintensity: 0.8284 0.9283 2.4380 14.0504 16.1277 0.0232 1.2391 7.2344 104.0690 6.5729 170.2803 71.2526 138.6842 17.0065 75.3395 21.2667 18.3695 1.5674 272.1830 4.3366 103.4448 3.2360 39.0674 171.9392 10.8400 536.0320 56.1398 100.2580 59.2491 86.2369
temp: 298.150 k
press: 1.00000 atm
elementType: 16 8 8 7 7 7 6 6 6 1 1 1
symmnumber: 1
zpe: 188777.8 jmol-1
zpe.correction: 0.071902 hartree
zpe.thermalcorrener: 0.079896 hartree
zpe.thermalcorrenthalpy: 0.080840 hartree
zpe.thermalcorrgfe: 0.038834 hartree
zpe.sumelectzpe: -828.199720 hartree
zpe.sumelectthermal: -828.191725 hartree
zpe.sumelectthermalent: -828.190781 hartree
zpe.sumelectthermalfe: -828.232787 hartree
dipole: -1.6908 1.3233 0.0018
dipole: 2.1471
quadrupole: -54.9030 -55.5817 -59.1650
quadrupole: 1.7110 0.0006 0.0074
quadrupole: 1.6469 0.9682 -2.6151 1.7110 0.0006 0.0074
hfenergy: -828.2716215 hartree
pointgroup: C01 [X(C3H3N3O2S1)]
dipole: 0.5443661 -0.6459325 0.0007081 debye
dipolederiv: -0.3095025 0.1191321 -0.0001277 0.1675502 0.2382493 0.0000458 -0.0001089 -0.0000517 0.2535527 -0.8472369 -0.5243075 -0.0002105 -0.6911506 -0.7632782 -0.0001565 0.0005998 0.0006797 -0.3972636 -0.8639508 0.2200957 -0.0002139 0.2206884 -0.8952195 0.0003683 0.0005727 -0.0006035 -0.3500291 0.5540468 -0.3696399 0.0002073 -0.4275093 -0.1900469 -0.000083 0.0000578 -0.000082 -0.2508532 -0.2569743 0.577747 0.000026 -0.3042683 -0.2413174 -0.0000404 -0.0000239 0.0003975 -0.3304882 -0.2364437 0.2412276 0.0002727 0.2171143 -1.1930033 0.0001806 0.0003321 0.0001923 -0.6792591 -0.7273333 -0.0196413 0.0000091 0.608202 -0.3086668 0.0000621 -0.0003 -0.0000063 0.0634689 -0.0648464 -0.5221646 -0.0000759 -0.1738311 1.2156416 -0.0002462 -0.0002882 -0.0003586 0.2079259 2.0131307 0.1382418 0.0001667 0.205591 1.3115729 -0.0000506 -0.000779 -0.0000517 0.293264 0.3261694 0.0271303 -0.0000513 -0.0174291 0.2882752 -0.0000455 -0.0001979 -0.000122 0.3920996 0.1519985 0.0073739 -0.0001368 0.0144182 0.2727279 0.0000191 -0.0000664 0.0000576 0.3935532 0.2609424 0.1048049 0.0001342 0.1806242 0.2650651 -0.0000538 0.0002021 -0.0000512 0.4040288 unknown
polarizability: 108.8566551|-9.3580275|90.908095|0.0101917|0.0027462|31.192845 unknown
InChI: InChI=1S/C3H3N3O2S/c4-2-1(3(7)8)5-9-6-2/h7H,4H2
charge 0 multiplicity 1
12 atoms
S  -2.179774 1.374693 -0.0003
O  2.330002 1.204419 0.000113
O  2.067145 -1.102196 -0.000494
N  -0.41259 1.550529 0.00036
N  -2.185687 -0.422467 -0.000631
N  -0.514451 -2.12851 0.000202
C  0.101327 0.301367 0.000567
C  -0.881179 -0.810527 -0.000025
C  1.556855 0.057274 0.001155
H  0.484686 -2.351996 0.000874
H  -1.231837 -2.849049 -0.000164
H  3.291803 0.944965 -0.000757
