program: Gaussian 09
title: 000251772
version: EM64L-G09RevD.01
frameworkgroup: C1[X(C9H10N4S)]
method: RPBEPBE
basis: SDD
operation: Freq
keyword: #p
keyword: freq=noraman
keyword: PBEPBE/SDD
title: #p freq=noraman PBEPBE/SDD
converged: NO YES NO NO
title: Mulliken charges:
elementType: S N N N N C C C C C C C C C H H H H H H H H H H
charge: 0.291015 0.010906 0.052713 0.025117 0.019936 0.112728 0.108196 0.113762 -0.101127 -0.386933 -0.774411 -0.763556 -0.397481 -0.826737 0.262929 0.231283 0.231693 0.230499 0.267354 0.229929 0.251642 0.283427 0.243607 0.283507
chargesum: 0.00000
title: Mulliken charges with hydrogens summed into heavy atoms:
elementType: S N N N N C C C C C C C C C
charge: 0.291015 0.010906 0.052713 0.025117 0.019936 0.112728 0.108196 0.113762 -0.101127 -0.386933 -0.048505 -0.035773 -0.145839 -0.016196
polarizability: 2.30757859e+02 3.41953990e+00 1.58470041e+02 1.17126129e-03 2.81532196e-02 6.78948321e+01
1716.lowfreq: -6.4395 -0.0019 -0.0010 0.0018 4.7433 9.8536 50.7019 76.5899 83.5372
frequency: 50.6956 76.5589 83.5268 122.7521 130.0371 130.7636 158.9863 176.1352 229.0961 266.3952 289.0263 316.0426 335.0144 400.8637 444.2980 479.3376 482.5985 546.5336 551.5327 610.8422 627.5989 658.1917 671.4785 697.6029 753.4207 816.3468 832.0215 928.2630 939.0910 978.7680 991.9228 998.6668 1015.9044 1018.9759 1056.2741 1129.5841 1151.6275 1195.1372 1225.7044 1299.7262 1322.8824 1345.9992 1372.5153 1381.4741 1388.3375 1397.9686 1406.5525 1435.5437 1438.8888 1446.3533 1446.9965 1456.7840 1469.2501 1475.3092 1495.7967 1541.1841 2980.9014 2981.5497 3025.0976 3054.7412 3056.2292 3122.3475 3126.5852 3150.3432 3155.6515 3163.8533
redmass: 3.7645 3.3838 1.0483 1.1439 2.7339 4.7177 2.1929 1.7198 3.5847 5.9490 2.5061 4.3313 3.6400 8.4778 7.0148 6.6725 6.5097 3.8546 4.4753 8.7159 8.9317 7.5616 7.4159 4.1091 5.7498 6.7259 10.8130 4.1656 1.4633 1.1843 1.3015 1.8067 2.1379 1.4221 1.7255 8.1271 4.1193 5.3757 7.9662 7.1167 3.3940 1.2055 4.0571 4.4978 1.4932 1.2597 1.7419 1.0515 1.2057 2.0523 1.2228 1.0480 1.0464 1.4857 8.3919 5.6806 1.0388 1.0389 1.0284 1.0963 1.0963 1.0983 1.0980 1.1043 1.1052 1.0922
irintensity: 0.5806 3.6278 0.2169 0.0063 1.6855 3.3023 0.0240 0.3069 2.4828 1.1334 0.7988 0.3944 0.1043 6.4708 2.4217 2.7326 2.2020 12.4223 0.6074 6.4546 9.3352 1.7694 10.3150 1.0524 19.6353 15.5905 0.5083 74.0627 10.9618 6.4969 0.1909 9.7720 2.3127 6.1409 0.0010 16.0559 43.9539 6.9396 8.1856 69.7188 61.3222 21.5496 56.6201 95.3446 24.4035 44.9185 17.0342 14.5924 3.9348 68.1758 86.1815 0.0667 40.9645 70.0615 69.9489 19.7247 17.2617 8.3549 20.8142 28.0300 0.1855 7.4632 6.0757 7.8629 9.1218 19.1031
temp: 298.150 k
press: 1.00000 atm
elementType: 16 7 7 7 7 6 6 6 6 6 6 6 6 6 1 1 1 1 1 1 1 1 1 1
symmnumber: 1
zpe: 469573.0 jmol-1
zpe.correction: 0.178851 hartree
zpe.thermalcorrener: 0.192376 hartree
zpe.thermalcorrenthalpy: 0.193320 hartree
zpe.thermalcorrgfe: 0.138246 hartree
zpe.sumelectzpe: -965.008825 hartree
zpe.sumelectthermal: -964.995300 hartree
zpe.sumelectthermalent: -964.994356 hartree
zpe.sumelectthermalfe: -965.049430 hartree
dipole: -0.9410 -2.9516 0.0049
dipole: 3.0980
quadrupole: -68.3962 -98.2467 -89.2523
quadrupole: 7.8888 -0.0023 0.0125
quadrupole: 16.9022 -12.9483 -3.9539 7.8888 -0.0023 0.0125
hfenergy: -965.1876764 hartree
pointgroup: C01 [X(C9H10N4S1)]
dipole: 0.4923109 1.1149446 0.0099151 debye
dipolederiv: -0.129409 0.2591511 0.008857 0.7031925 -0.5134475 -0.0378105 0.0193173 -0.0203307 -0.0516296 -0.1682337 -0.2329846 -0.0080491 0.1718277 -0.3118543 -0.0084824 0.0007707 0.0072033 -0.2340335 -0.4530701 -0.1094893 0.0042812 -0.0912977 -0.249915 0.0037698 0.0044667 0.0048587 -0.2689545 -0.7708946 -0.0499805 0.0196277 -0.0511859 -0.488501 -0.004121 0.0208132 -0.004303 -0.2276873 -0.3486425 -0.2220369 0.0028206 0.3282843 -1.2274609 -0.0375828 0.0149726 -0.0158176 -0.1497431 -0.4822252 0.377758 0.034421 -0.1065656 -0.226291 -0.0054044 0.0230023 -0.0241736 0.1767523 -0.0699764 0.3518762 0.0141689 0.8308069 0.3523738 -0.0251778 0.0253377 -0.0075083 0.0837356 0.8364546 -0.0313698 -0.0289642 -0.571671 0.0773112 0.0217382 -0.0410137 0.0008936 0.0851713 0.4473114 0.2080346 -0.0056266 0.273476 0.3292305 -0.0067702 -0.0040905 -0.0043545 0.1726168 0.7017363 -0.3285766 -0.0353802 -0.9457257 1.2242887 0.0649359 -0.0491879 0.040905 -0.0297744 -0.2149092 -0.1844456 0.0052854 -0.1775555 -0.1415539 0.0025707 0.0067467 0.0037537 0.0349341 -0.4158401 0.0250597 0.0172083 -0.0369156 0.033346 0.0012509 0.0132618 -0.0009081 0.0306442 0.6413661 -0.0600387 -0.0272714 -0.1365009 0.8375659 0.0252509 -0.0294379 0.0223922 -0.0184795 0.2062017 -0.0439674 -0.0069513 -0.0759209 0.0525122 0.0034214 -0.0077713 0.002143 0.0470756 0.0628342 0.1315445 0.0060481 0.0196608 -0.024943 -0.0049876 0.0027082 -0.009448 0.1209779 0.0079858 -0.0246616 -0.1025508 -0.0272216 0.0736124 0.0465499 -0.124427 -0.0044756 -0.0191948 0.0262052 -0.0295056 0.0970581 -0.0373674 0.0754248 -0.0382424 0.1183217 0.0119393 -0.0392885 0.0155931 -0.0128258 -0.0446927 -0.0245531 0.0765085 -0.0978435 -0.0932839 -0.0702881 -0.0291189 0.0963888 -0.0136903 0.0007214 0.0995703 -0.0624785 -0.0095547 0.0044097 -0.0050283 0.1228023 0.0256855 -0.0100106 0.0402395 -0.0224599 0.0656484 0.1059569 0.0892048 0.0772037 -0.0286566 0.012822 -0.0921535 0.0022688 -0.0619453 -0.0288502 -0.0012214 0.0026855 -0.0002996 0.12618 -0.0171163 0.0052987 -0.0252194 -0.0915848 0.0685185 -0.0847322 -0.0220527 -0.0586519 -0.0170684 0.0027827 0.0780616 0.0067447 0.1170093 -0.0523002 -0.0091292 0.0076746 -0.0075818 0.1260245 -0.0130503 0.0089526 0.0249552 -0.085357 0.0612548 0.0956154 0.0175716 0.0618767 -0.0132856 unknown
polarizability: 230.4191697|-4.2118444|158.5131627|-6.3071114|2.3080461|68.1904003 unknown
InChI: InChI=1S/C9H10N4S/c1-5-6(2)13-8-7(12-5)9(14-3)11-4-10-8/h4H,1-3H3
charge 0 multiplicity 1
24 atoms
S  -2.395976 1.964991 0.243223
N  0.569694 1.276462 0.116929
N  1.647363 -1.37948 0.009136
N  -0.550442 -2.286911 0.072345
N  -2.486095 -0.784324 0.183793
C  -0.247994 0.166372 0.120681
C  1.90223 1.066748 0.060458
C  2.444848 -0.28848 0.00589
C  0.278991 -1.173317 0.067323
C  -1.684853 0.301691 0.178512
C  2.805642 2.275196 0.055536
C  3.934978 -0.52246 -0.056309
C  -1.869417 -2.023059 0.130693
C  -4.220659 1.510964 0.305181
H  2.193042 3.187607 0.105803
H  3.502612 2.26178 0.914929
H  3.427984 2.310088 -0.858767
H  4.446976 -0.096126 0.827326
H  4.12942 -1.60423 -0.096506
H  4.381592 -0.041104 -0.94701
H  -2.546611 -2.882679 0.136757
H  -4.495966 0.945832 -0.59596
H  -4.757893 2.471094 0.350562
H  -4.423163 0.901746 1.196875
