program: Gaussian 09
title: 000251765
version: EM64L-G09RevD.01
frameworkgroup: C1[X(C5H9N3O)]
method: RPBEPBE
basis: SDD
operation: Freq
keyword: #pfreq=noraman
keyword: PBEPBE/SDD
title: #p freq=noraman PBEPBE/SDD
converged: YES YES NO NO
title: Mulliken charges:
elementType: O N N N C C C C C H H H H H H H H H
charge: -0.321423 -0.398668 -0.405416 -0.027083 -0.377880 -0.421908 0.330341 -0.603235 -0.136652 0.229877 0.268283 0.293948 0.247506 0.302237 0.293319 0.223778 0.224469 0.278508
chargesum: 0.00000
title: Mulliken charges with hydrogens summed into heavy atoms:
elementType: O N N N C C C C C
charge: -0.321423 -0.096430 -0.112098 -0.027083 0.120280 0.119546 0.330341 0.123519 -0.136652
polarizability: 8.97534150e+01 1.34626285e+00 7.54755857e+01 -4.10976096e+00 5.95443584e+00 5.73520197e+01
1716.lowfreq: -10.8944 -0.0010 -0.0009 -0.0005 4.6536 12.5334 38.0324 55.3355 99.4693
frequency: 38.0256 55.3182 99.4436 119.9723 140.0485 166.0714 243.1086 311.0197 343.4912 369.9333 384.7843 487.8068 521.6252 573.0461 665.7704 713.8140 814.4607 848.9412 908.0917 1001.4350 1046.4269 1060.6816 1127.5985 1132.7035 1174.1502 1197.8483 1233.7425 1267.7953 1315.6290 1365.3590 1422.3943 1440.3601 1447.4472 1455.0463 1480.3636 1487.8287 1530.4850 1632.6548 2193.7299 2974.4845 3005.9141 3028.5479 3051.3153 3068.7072 3099.2726 3109.5817 3553.9968 3563.3943
redmass: 5.8386 4.4055 2.9576 1.1831 3.3948 4.0079 2.6249 1.7399 2.2238 4.2948 2.7240 3.5704 1.2248 3.0621 3.7411 9.2449 2.6741 2.8896 2.7608 2.7431 2.3117 4.0641 1.2785 1.5269 2.8835 1.1849 1.5775 1.5199 1.2175 1.2450 1.1802 1.2107 1.0875 1.2807 1.2831 1.0601 1.8033 5.0441 12.3844 1.0355 1.0592 1.0613 1.1027 1.0999 1.1057 1.0974 1.0781 1.0771
irintensity: 4.3683 22.3009 8.1083 3.6408 2.8431 8.3318 3.3129 11.0511 19.2116 7.0951 5.6350 1.2754 249.5356 28.5998 4.4812 15.3563 6.3508 5.7402 9.2707 2.2723 0.8707 9.9145 1.5435 36.0005 10.4009 30.4129 115.0905 80.8182 38.3313 5.9629 38.1223 22.8731 20.5484 9.8349 160.6090 28.2399 325.2728 173.2264 16.8274 86.9762 8.9459 33.2620 43.2005 7.6386 6.4490 1.9872 8.2818 19.4166
temp: 298.150 k
press: 1.00000 atm
elementType: 8 7 7 7 6 6 6 6 6 1 1 1 1 1 1 1 1 1
symmnumber: 1
zpe: 378460.6 jmol-1
zpe.correction: 0.144148 hartree
zpe.thermalcorrener: 0.154619 hartree
zpe.thermalcorrenthalpy: 0.155563 hartree
zpe.thermalcorrgfe: 0.107176 hartree
zpe.sumelectzpe: -434.712098 hartree
zpe.sumelectthermal: -434.701626 hartree
zpe.sumelectthermalent: -434.700682 hartree
zpe.sumelectthermalfe: -434.749070 hartree
dipole: 1.9000 -0.2296 2.5312
dipole: 3.1733
quadrupole: -56.3615 -58.2503 -51.4488
quadrupole: 17.6090 1.5121 1.2020
quadrupole: -1.0080 -2.8968 3.9047 17.6090 1.5121 1.2020
hfenergy: -434.8562456 hartree
pointgroup: C01 [X(C5H9N3O1)]
dipole: -0.7512789 -0.0451892 -0.9961096 debye
dipolederiv: -0.7354351 0.0252746 0.0994782 0.0721037 -0.7631519 0.2855699 0.0829055 0.3106131 -0.6902415 -1.2971315 0.1666944 0.0834665 0.2017713 -0.3489239 -0.0811327 0.3561024 -0.2002514 -0.7146593 -1.0911141 0.3474085 -0.0560538 0.5259484 -0.7702321 -0.0916857 -0.0734102 -0.0626263 -0.3920712 -0.3071096 -0.0218084 -0.0182291 -0.1194254 -0.288898 -0.039162 0.0425138 0.0231847 -0.2322699 0.7047564 -0.113042 0.1446274 -0.3622284 0.2687501 0.0755112 0.2888743 0.0846327 0.3476491 -0.057103 -0.0925047 -0.0584284 -0.1193874 0.0316239 -0.0416486 -0.1399832 0.0098994 0.0255608 1.8652564 -0.5098418 -0.3517209 -0.6261081 1.1175356 -0.3830809 -0.4153332 -0.3902617 0.8459841 0.5421718 -0.1026316 -0.0480604 0.0375818 0.1239017 0.135662 -0.2136448 0.2305806 0.1907755 0.061958 0.1184371 -0.0223586 0.2562771 0.1523991 0.0101082 -0.0953313 -0.0498914 -0.0958907 -0.0498004 0.0648712 0.0780126 0.0227428 0.1006962 0.0120572 0.0612484 -0.0364316 -0.0922016 0.0346711 -0.0959333 -0.0271358 -0.0146674 -0.0493632 -0.0084482 -0.0807763 0.0370171 0.08965 0.1390798 -0.0329574 0.081992 -0.0140672 0.0654632 -0.0359166 0.0551212 -0.029792 0.0344719 -0.0512111 0.0818601 -0.0347163 0.050788 -0.0223907 0.0207773 -0.0479843 0.006619 0.127139 0.1388688 0.048823 0.0906511 0.0597516 0.1127728 0.1149668 0.0697815 0.085058 0.2848148 0.1447919 0.0525352 0.1150956 0.0319597 0.2188394 0.1052639 0.1215156 0.1069717 0.1744712 -0.1968465 0.0285717 -0.0711721 -0.0149009 0.1024505 -0.0432827 -0.1230587 -0.0465407 -0.008617 -0.0067312 0.0192074 0.0235423 0.0779111 -0.1269488 -0.1375946 0.0754502 -0.1282463 0.0529961 0.1609283 0.0150362 -0.0289904 -0.0660507 0.0754762 0.1020356 0.036009 0.0494649 0.0524388 unknown
polarizability: 89.4892948|-2.4087137|75.6368978|-4.4830921|-5.8171287|57.4548278 unknown
InChI: InChI=1S/C5H9N3O/c1-7-5(9)8-4-2-3-6/h7-8H,2,4H2,1H3
charge 0 multiplicity 1
18 atoms
O  -1.43124 -1.069593 0.73802
N  -0.098041 -0.162486 -0.950166
N  -2.162989 0.840562 -0.413715
N  3.138698 1.448139 0.186126
C  0.940015 -1.168793 -0.732367
C  1.845245 -0.860041 0.502852
C  -1.25052 -0.177302 -0.151861
C  -3.409039 0.962262 0.348655
C  2.571649 0.410026 0.34906
H  1.555822 -1.251702 -1.644397
H  0.449072 -2.138272 -0.544656
H  1.20111 -0.817637 1.400136
H  2.572258 -1.681501 0.648936
H  0.120043 0.643434 -1.537162
H  -1.993007 1.490454 -1.181505
H  -4.296982 0.814802 -0.294869
H  -3.48382 1.947782 0.844809
H  -3.400274 0.174866 1.119201
