program: Gaussian 09
title: 000251773
version: EM64L-G09RevD.01
frameworkgroup: C1[X(C9H11N5)]
method: RPBEPBE
basis: SDD
operation: Freq
keyword: #pfreq=noraman
keyword: PBEPBE/SDD
title: #p freq=noraman PBEPBE/SDD
converged: YES YES NO NO
title: Mulliken charges:
elementType: N N N N N C C C C C C C C C H H H H H H H H H H H
charge: -0.042556 0.048052 -0.358587 0.003652 -0.070249 -0.096935 0.105823 0.110694 -0.092063 0.183987 -0.776540 -0.767336 -0.387947 -0.623551 0.248999 0.233724 0.230737 0.225149 0.267453 0.229221 0.339505 0.244944 0.285725 0.228979 0.229119
chargesum: 0.00000
title: Mulliken charges with hydrogens summed into heavy atoms:
elementType: N N N N N C C C C C C C C C
charge: -0.042556 0.048052 -0.019082 0.003652 -0.070249 -0.096935 0.105823 0.110694 -0.092063 0.183987 -0.063081 -0.045513 -0.143003 0.120272
polarizability: 2.04547960e+02 3.16401137e+00 1.49417189e+02 4.46750914e-02 -9.80901641e-02 6.62252069e+01
1716.lowfreq: -10.4257 -0.0010 -0.0008 -0.0005 7.0941 8.3913 58.4659 68.3956 90.7423
frequency: 58.3860 68.0797 90.7339 109.4868 134.5869 151.1725 152.4684 210.5567 265.8758 283.4088 296.2331 350.0232 356.0693 449.4715 454.1393 497.6936 539.0162 541.7545 607.6814 641.6406 674.6050 697.1112 699.9366 718.7787 792.7806 833.4280 844.0760 947.2097 960.8028 1003.1135 1015.1811 1020.5028 1054.9392 1090.0932 1121.1071 1126.6092 1170.6062 1182.3364 1233.0217 1308.2889 1322.0349 1336.5497 1373.2713 1383.4654 1396.9489 1399.3142 1416.0858 1427.5393 1441.8462 1450.8050 1456.7286 1469.0110 1472.5704 1481.1870 1487.7719 1533.9177 1537.1393 1593.7578 2978.4888 2979.7226 2979.9166 3053.8725 3055.3646 3055.5724 3114.1588 3116.8329 3123.4716 3153.6464 3504.9436
redmass: 2.5052 1.1598 1.0310 2.9122 2.4925 1.4804 3.1235 4.4199 5.8925 2.4702 3.3913 3.7638 4.0759 6.7816 6.4710 6.3737 3.9008 4.4927 7.0496 5.4123 6.1758 1.3743 5.5245 2.8198 4.2492 10.9466 6.9441 1.4670 2.5440 2.0841 2.4505 1.4227 1.7097 1.8043 1.2878 5.0477 3.7226 3.8611 6.3937 5.5455 2.9769 4.6572 3.4242 1.3713 1.5030 1.7885 1.7009 1.3200 1.2502 1.8645 1.0575 1.0465 1.1590 1.6824 1.0455 4.3463 5.2293 3.9747 1.0355 1.0385 1.0390 1.0966 1.0964 1.1019 1.0982 1.0984 1.0979 1.0918 1.0766
irintensity: 0.9439 0.0637 0.0862 2.7475 0.0126 0.6429 3.4068 0.3461 3.1550 0.5962 0.4095 0.6847 7.3862 1.0922 1.9465 10.2862 15.4389 0.5725 3.3952 7.1074 1.1921 63.8124 15.7892 43.2190 4.4570 4.5553 14.5481 9.6458 22.2606 6.1754 5.4619 6.8492 0.1136 13.9882 0.0075 2.9328 57.9886 13.3132 12.7797 77.6996 52.6985 185.4821 7.7600 42.2478 54.9062 9.6128 7.5355 21.3646 17.5119 1.4685 0.1181 39.0767 4.8987 82.5315 15.2032 90.8187 38.2219 446.1463 97.0800 18.6574 10.0472 27.8395 2.5706 34.3895 11.0454 1.2005 6.2239 25.9814 53.1023
temp: 298.150 k
press: 1.00000 atm
elementType: 7 7 7 7 7 6 6 6 6 6 6 6 6 6 1 1 1 1 1 1 1 1 1 1 1
symmnumber: 1
zpe: 513490.7 jmol-1
zpe.correction: 0.195578 hartree
zpe.thermalcorrener: 0.208618 hartree
zpe.thermalcorrenthalpy: 0.209562 hartree
zpe.thermalcorrgfe: 0.155805 hartree
zpe.sumelectzpe: -622.311279 hartree
zpe.sumelectthermal: -622.298239 hartree
zpe.sumelectthermalent: -622.297295 hartree
zpe.sumelectthermalfe: -622.351052 hartree
dipole: -1.0397 -5.6685 -0.0011
dipole: 5.7630
quadrupole: -67.7414 -87.2271 -82.5778
quadrupole: -0.1106 0.0203 -0.0427
quadrupole: 11.4407 -8.0450 -3.3957 -0.1106 0.0203 -0.0427
hfenergy: -622.5068569 hartree
pointgroup: C01 [X(C9H11N5)]
dipole: 0.4656419 2.2163436 -0.1088456 debye
dipolederiv: -0.0651333 -0.1980104 0.0082969 0.2595932 -0.3729069 0.0062572 -0.0126349 0.0065395 -0.2489123 -0.4866259 -0.1525098 0.0085319 -0.1101088 -0.241084 0.0000388 0.0059493 -0.0017614 -0.271775 -0.6608481 0.3842902 -0.0174796 0.7498371 -1.0326403 0.0264217 -0.0358644 0.027643 -0.4442757 -1.1257234 -0.1050044 0.0067586 -0.2155492 -0.5357103 0.0148864 0.0112118 0.0147987 -0.2340007 -0.3647347 -0.2094452 0.0102663 0.544618 -1.1625992 0.0432309 -0.0255969 0.0442444 -0.2369123 -0.4322364 0.4079084 -0.0183731 -0.4821692 -0.2174935 0.0168928 0.0241952 0.0150026 0.1199998 -0.1561186 0.3280199 -0.0135547 0.7352493 0.3137455 -0.012229 -0.0251319 -0.0058291 0.0758028 0.7973078 -0.0183746 -0.0033318 -0.5255859 0.105896 -0.00133 0.0124444 -0.0015926 0.0695824 0.5454586 0.2564696 -0.0134629 0.6928525 0.3943043 -0.012149 -0.0336034 -0.0110631 0.1735776 0.6347766 -0.290626 0.0125218 -0.9179207 1.4464412 -0.0588395 0.0422946 -0.0596581 0.1681623 -0.1756378 -0.1738807 0.0074615 -0.1557671 -0.1185843 0.0070263 -0.0055898 -0.0019643 0.040476 -0.3789987 0.0259481 0.0027853 -0.0224652 0.0327123 0.0019842 0.0210141 0.00057 0.0391691 0.9446859 -0.0569927 0.0010635 -0.3560503 0.8428488 -0.0421855 0.0157886 -0.0422232 -0.046118 0.5505073 -0.3481152 0.0151655 -0.0721131 0.0573645 0.0096664 0.0026491 0.0096733 0.2605785 0.0516181 0.1435561 -0.0130501 0.0201473 -0.046587 0.0145257 -0.0011087 0.016459 0.1167938 0.0136364 -0.0426146 -0.096752 -0.0476919 0.071153 0.0306824 -0.1201359 -0.0213164 -0.0408269 0.002436 -0.0269178 0.1054549 -0.0252312 0.0691093 -0.0481549 0.1311132 0.0071639 -0.0244971 0.013041 -0.0180438 -0.0440874 -0.0414797 0.0519886 -0.1113384 -0.0966514 -0.0826755 -0.0174405 0.0988038 -0.012684 0.0003608 0.098445 -0.0624126 0.0174228 -0.0111022 0.0162981 0.121032 0.0141194 -0.0076889 0.045823 -0.0231706 0.0853215 0.091332 0.0947179 0.0642833 -0.0505059 0.16342 0.0214093 -0.0006946 -0.0564546 0.2496344 0.0035356 0.0026769 0.0032725 0.3200943 0.0045533 -0.1048004 0.0052266 -0.0877649 -0.0325343 0.0075219 0.0045709 0.0076686 0.1206045 0.0924333 -0.0203878 0.0009482 -0.1573287 0.0640632 0.002602 0.0071954 0.002635 0.1277846 -0.0401896 0.1084945 -0.0209729 0.0939966 0.0298954 0.1006936 -0.1010585 0.1372054 -0.0798317 -0.0405508 0.1100005 0.0110943 0.1021122 0.0080745 -0.1084945 0.0926565 -0.1453737 -0.0585618 unknown
polarizability: 204.672275|1.7386847|149.1067655|-0.4456111|-3.9187811|66.4113148 unknown
InChI: InChI=1S/C9H11N5/c1-5-6(2)14-9-7(13-5)8(10-3)11-4-12-9/h4,10H,1-3H3
charge 0 multiplicity 1
25 atoms
N  0.501022 1.246183 -0.051341
N  1.573076 -1.406118 0.079537
N  -2.268748 1.566964 -0.057213
N  -0.637408 -2.30475 0.12629
N  -2.576724 -0.787437 0.056203
C  -0.311814 0.13722 0.005597
C  1.837711 1.037901 -0.042913
C  2.372041 -0.315205 0.023651
C  0.202273 -1.200567 0.071004
C  -1.759603 0.302628 0.001603
C  2.74449 2.24295 -0.101868
C  3.863533 -0.555594 0.030783
C  -1.958776 -2.017522 0.11433
C  -3.699681 1.878373 -0.068731
H  2.137576 3.157364 -0.18833
H  3.373025 2.320633 0.805715
H  3.435225 2.18979 -0.964305
H  4.356802 -0.024602 0.866653
H  4.053437 -1.634782 0.127917
H  4.334635 -0.193052 -0.902996
H  -1.566235 2.312612 -0.094498
H  -2.639394 -2.874444 0.156449
H  -4.254198 0.928521 -0.026283
H  -3.979852 2.419548 -0.991603
H  -3.977418 2.497986 0.804251
