program: Gaussian 09
title: 000251775
version: EM64L-G09RevD.01
frameworkgroup: C1[X(C13H14Cl2N2O2)]
method: RPBEPBE
basis: SDD
operation: Freq
keyword: #p
keyword: freq=noraman
keyword: PBEPBE/SDD
title: #p freq=noraman PBEPBE/SDD
converged: YES YES NO NO
title: Mulliken charges:
elementType: Cl Cl O O N N C C C C C C C C C C C C C H H H H H H H H H H H H H H
charge: -0.065670 -0.077355 -0.447468 -0.281017 -0.148644 -0.392509 0.499397 0.156025 0.232183 -0.417671 -0.421563 -0.553432 -0.356772 0.139494 -0.371261 -0.315445 -0.557281 -0.552797 0.090044 0.231297 0.273932 0.246081 0.270736 0.281718 0.222440 0.228296 0.313280 0.285744 0.259933 0.287696 0.265164 0.298498 0.376927
chargesum: 0.00000
title: Mulliken charges with hydrogens summed into heavy atoms:
elementType: Cl Cl O O N N C C C C C C C C C C C C C
charge: -0.065670 -0.077355 -0.070541 -0.281017 -0.148644 -0.079229 0.499397 0.156025 0.232183 0.087559 0.095253 -0.271713 -0.134332 0.139494 -0.142965 -0.029701 -0.009652 0.010865 0.090044
polarizability: 2.64569206e+02 -3.53037270e-01 1.72782607e+02 -8.46398542e+00 3.56526181e+01 1.31102330e+02
1716.lowfreq: -8.3758 -5.5846 0.0021 0.0024 0.0026 4.9817 22.3142 33.6845 48.4439
frequency: 21.4945 33.6799 48.3638 60.6027 71.5461 84.5473 102.1219 110.7463 133.3116 148.9368 177.6470 214.9498 267.2832 277.9039 328.6961 347.5693 374.5786 384.3419 408.7589 429.6765 454.5422 505.2082 529.8248 537.8768 563.6339 566.2234 591.3053 599.6067 606.2196 611.8778 640.7283 645.1272 718.2507 724.8941 764.9093 788.0241 789.5839 846.2905 846.7859 868.9043 876.0209 911.3972 919.8774 921.8857 946.8704 961.8042 1005.9604 1029.0877 1047.3908 1077.5931 1105.9162 1158.2858 1160.9790 1172.4597 1180.2584 1211.0819 1227.1147 1255.3804 1261.2154 1270.2463 1293.2778 1303.7029 1311.3132 1343.2650 1352.0838 1358.5831 1378.9172 1399.8296 1426.6774 1438.8903 1439.9218 1460.1202 1473.4997 1484.0126 1508.0682 1523.4870 1591.0363 1644.8502 1650.9414 2965.6378 2974.0065 3052.0819 3058.6900 3070.8246 3077.1475 3135.9244 3142.0493 3148.3952 3170.3311 3185.8135 3245.1204 3534.1640 3602.8661
redmass: 10.9520 10.9278 11.3174 8.1366 10.2784 5.5784 4.0112 5.6915 4.1433 4.5048 4.3726 6.4360 5.0672 5.2415 4.5966 4.6187 2.9421 4.1823 4.0302 2.9735 3.5804 2.2661 3.3087 1.5183 1.3502 3.4369 5.1528 4.5644 4.2149 1.8178 3.4366 4.6749 5.2351 5.1806 3.5512 2.4306 2.5094 1.5340 2.9332 1.8396 1.5540 3.1880 1.6052 1.5011 2.4492 4.1388 1.8602 2.5153 1.8638 2.4964 1.4040 1.3494 1.1741 1.3755 1.8307 1.6827 1.4042 1.6043 1.7566 1.9406 1.3876 1.3062 1.8858 2.0020 1.6330 1.6381 1.6038 7.2142 2.6294 1.1059 1.1165 1.2246 2.2489 1.6840 2.2011 5.5546 6.0649 7.2345 8.2013 1.0694 1.0688 1.0580 1.0590 1.0921 1.0919 1.0895 1.1095 1.1101 1.0932 1.0912 1.0990 1.0641 1.0811
irintensity: 0.4972 1.2551 0.9278 1.5395 2.7113 3.9677 4.3305 7.0123 2.4834 1.7318 0.8500 6.4628 3.8733 0.8258 5.4420 6.6735 3.1570 3.0270 4.7666 13.9488 13.1120 1.7786 10.3985 141.4269 5.7646 17.3885 19.4416 15.9724 29.7168 82.9898 16.1973 17.8852 25.0436 2.3686 11.2458 23.8134 30.3371 16.1595 12.3736 1.3844 27.9402 99.2514 24.5248 14.5465 31.8003 262.6012 5.1487 21.0324 4.0109 112.2970 80.5888 1.7603 14.4589 28.0794 52.4168 47.4479 49.8992 13.3875 25.9098 6.1153 2.5689 28.9392 19.4675 21.6224 196.6980 21.2444 10.9690 72.5618 55.0262 4.6038 9.2371 38.5075 79.5354 1.3638 97.0639 99.5006 61.6063 161.0810 341.9262 40.1210 16.9735 24.3918 12.2821 2.0220 9.2881 13.0411 20.2097 15.0424 19.7221 8.4373 5.1897 45.4885 77.2205
temp: 298.150 k
press: 1.00000 atm
elementType: 17 17 8 8 7 7 6 6 6 6 6 6 6 6 6 6 6 6 6 1 1 1 1 1 1 1 1 1 1 1 1 1 1
symmnumber: 1
zpe: 661971.1 jmol-1
zpe.correction: 0.252131 hartree
zpe.thermalcorrener: 0.270268 hartree
zpe.thermalcorrenthalpy: 0.271212 hartree
zpe.thermalcorrgfe: 0.203328 hartree
zpe.sumelectzpe: -1682.482676 hartree
zpe.sumelectthermal: -1682.464540 hartree
zpe.sumelectthermalent: -1682.463596 hartree
zpe.sumelectthermalfe: -1682.531480 hartree
dipole: -2.3088 -3.9951 -2.1396
dipole: 5.0862
quadrupole: -113.8719 -114.6699 -130.5382
quadrupole: 4.1263 0.9568 15.2313
quadrupole: 5.8215 5.0234 -10.8449 4.1263 0.9568 15.2313
hfenergy: -1682.7348079 hartree
pointgroup: C01 [X(C13H14Cl2N2O2)]
dipole: -0.8081944 1.80599 0.2990446 debye
polarizability: 265.0045006|1.263623|191.0730528|-5.1092304|12.3301256|112.3765899 unknown
InChI: InChI=1S/C13H14Cl2N2O2/c14-3-5-17(6-4-15)9-1-2-12-10(7-9)11(8-16-12)13(18)19/h1-2,7-8,16,18H,3-6H2
charge 0 multiplicity 1
33 atoms
Cl 4.265732 0.222082 -2.700521
Cl 3.614972 -2.274818 2.135951
O  -4.666837 -1.651298 -0.068608
O  -2.508752 -2.509787 -0.251069
N  2.248807 -0.171489 -0.072464
N  -2.877779 2.110205 0.466699
C  0.989197 0.449742 0.074896
C  -1.457142 0.342124 0.138669
C  -1.514992 1.754901 0.366583
C  3.496807 0.596539 -0.001228
C  2.344239 -1.618249 -0.30869
C  -0.214108 -0.309827 -0.006095
C  0.894464 1.870326 0.309138
C  -2.834263 -0.133858 0.111152
C  -0.341149 2.526152 0.455951
C  -3.665534 0.9819 0.314153
C  3.839048 1.391283 -1.27158
C  2.155178 -2.489047 0.94145
C  -3.259083 -1.508816 -0.084256
H  3.461969 1.311972 0.846817
H  4.322773 -0.096303 0.229729
H  1.584517 -1.932133 -1.053992
H  3.323131 -1.838176 -0.766208
H  -0.222013 -1.387566 -0.177692
H  1.800459 2.477224 0.382226
H  -0.368557 3.60697 0.632258
H  -3.227916 3.05246 0.628774
H  -4.751573 1.017442 0.355888
H  4.736748 2.014165 -1.13056
H  2.995545 1.99226 -1.639993
H  2.145093 -3.56097 0.689826
H  1.266419 -2.215912 1.526874
H  -4.878801 -2.6131 -0.204676
