program: Gaussian 09
title: 000251782
version: EM64L-G09RevD.01
frameworkgroup: C1[X(C15H20N2O4)]
method: RPBEPBE
basis: SDD
operation: Freq
keyword: #p
keyword: freq=noraman
keyword: PBEPBE/SDD
title: #p freq=noraman PBEPBE/SDD
converged: YES YES NO NO
title: Mulliken charges:
elementType: O O O O N N C C C C C C C C C C C C C C C H H H H H H H H H H H H H H H H H H H H
charge: -0.481625 -0.450686 -0.286623 -0.306314 -0.174628 -0.390889 0.443886 0.147495 0.221040 -0.431671 -0.418093 -0.502510 0.111561 -0.364544 -0.358244 -0.335049 -0.340017 -0.326557 0.186173 -0.259117 -0.666653 0.246816 0.221148 0.234046 0.238902 0.256893 0.232400 0.225530 0.310702 0.281352 0.226665 0.222416 0.217682 0.200580 0.376811 0.347950 0.234560 0.218328 0.215447 0.222616 0.252222
chargesum: 0.00000
title: Mulliken charges with hydrogens summed into heavy atoms:
elementType: O O O O N N C C C C C C C C C C C C C C C
charge: -0.104814 -0.102736 -0.286623 -0.306314 -0.174628 -0.080187 0.443886 0.147495 0.221040 0.036292 0.054854 -0.245616 0.111561 -0.132144 -0.132714 -0.053697 0.109063 0.091705 0.186173 0.193771 0.023632
polarizability: 2.96602610e+02 -6.88455335e+00 2.13377527e+02 -9.43322615e+00 -8.29028295e+00 1.11905361e+02
1716.lowfreq: -8.2832 -0.0001 0.0005 0.0006 2.4635 3.8324 26.0987 37.3416 46.6313
frequency: 25.8691 37.3321 46.6223 49.4515 56.3383 64.1979 89.7007 102.0003 108.3270 133.8744 151.9519 170.3972 188.8543 226.3156 248.2183 254.9630 262.6359 275.7016 295.9095 320.6485 329.7286 334.7339 375.6726 392.4784 424.4426 434.2502 443.4651 496.7066 519.1414 548.7869 564.7976 579.7615 603.7069 614.0695 634.5701 712.2256 713.1036 734.3199 762.2278 787.6487 794.2283 806.7259 817.9971 827.7486 835.7163 841.5089 867.4806 894.0402 921.6220 950.8504 973.9816 976.9363 986.5370 989.3846 1000.2651 1025.8376 1041.8565 1089.9416 1094.2054 1108.4057 1135.4222 1154.0270 1159.5811 1167.3918 1199.7021 1206.9351 1212.4195 1238.4409 1254.8624 1263.7176 1280.0828 1287.7954 1295.1914 1311.7962 1335.6215 1343.0932 1349.3603 1358.3893 1366.1969 1381.7546 1388.8125 1404.1379 1412.1225 1427.7743 1454.6564 1461.6496 1461.9109 1469.5302 1474.4086 1483.0680 1485.0038 1495.0082 1512.7022 1513.7929 1583.1268 1609.1653 1651.8880 2950.1031 2965.9868 2991.2712 2992.2794 3002.7578 3011.3226 3028.4543 3054.0865 3072.2924 3081.1466 3085.7869 3091.0960 3116.6884 3133.4345 3163.7831 3227.2677 3243.0976 3473.0254 3579.2128 3601.5548
redmass: 5.0222 3.5392 5.0079 4.6120 5.6228 5.2039 4.4298 3.7176 2.6739 3.6360 3.6213 3.2193 2.4685 1.5383 2.4227 1.2483 3.8879 4.8544 5.9642 3.0258 5.1299 3.5846 4.7968 3.0042 3.9749 4.4193 3.3472 2.7325 1.1149 1.7450 4.0584 3.5002 2.0648 4.9037 4.0444 3.9355 5.1541 3.9878 3.7319 1.7037 2.2802 1.4427 1.7108 1.9470 1.4718 2.2512 1.6022 4.1084 1.3293 3.1078 4.1974 3.4146 3.7466 4.0183 3.1997 3.8416 1.5875 1.8624 2.1173 1.5642 2.2475 1.6485 1.4964 1.4214 1.2622 1.2404 1.3975 1.7746 1.5618 2.1884 1.1221 1.2546 2.5044 1.4498 1.6752 1.3818 1.2796 1.5135 1.3196 1.5657 1.2367 5.1010 1.3997 3.0083 1.1394 1.1163 1.0954 2.1201 1.2887 1.1304 1.0572 1.3025 2.7433 3.8089 7.0772 7.4680 7.9798 1.0552 1.0674 1.0361 1.0625 1.1067 1.0606 1.0589 1.0972 1.1042 1.1012 1.0979 1.1031 1.1057 1.0887 1.0940 1.0898 1.0987 1.0683 1.0668 1.0810
irintensity: 1.2921 0.0353 1.1601 1.5984 0.6798 3.0537 0.8962 1.8258 11.4166 9.0785 1.7136 8.2219 4.7129 1.3703 23.8733 116.3046 3.8708 1.7852 11.1285 26.3102 4.6759 9.9953 28.8052 11.3068 1.0353 5.6628 0.2776 17.0384 94.4549 62.2039 14.0802 22.4408 34.7980 3.8819 3.3635 10.5324 15.4747 1.6350 11.2603 51.5101 9.9101 8.6644 1.7748 4.1736 12.9755 4.4193 22.4757 14.3648 1.1174 112.3100 181.7863 0.5000 19.5229 10.4054 18.0645 244.1723 43.6324 34.3728 34.6329 18.1457 220.8454 22.0549 53.5441 9.5022 15.5595 11.3103 79.2110 26.0570 62.9591 12.6503 8.6894 46.9820 57.0922 70.1382 4.5640 33.1318 27.1959 2.0455 44.2766 34.3187 26.1231 86.0753 3.9077 28.0604 20.2863 7.6807 14.8147 45.3019 32.2123 10.3450 10.6066 13.5969 41.2208 202.6110 103.3966 252.5790 179.2691 45.2010 32.6972 24.3317 43.6788 42.7713 47.6230 42.6413 8.6175 10.1587 97.3929 39.5593 3.8205 36.4808 10.7550 20.9179 1.8218 3.9750 86.0051 3.8368 76.8860
temp: 298.150 k
press: 1.00000 atm
elementType: 8 8 8 8 7 7 6 6 6 6 6 6 6 6 6 6 6 6 6 6 6 1 1 1 1 1 1 1 1 1 1 1 1 1 1 1 1 1 1 1 1
symmnumber: 1
zpe: 875759.8 jmol-1
zpe.correction: 0.333559 hartree
zpe.thermalcorrener: 0.354886 hartree
zpe.thermalcorrenthalpy: 0.355831 hartree
zpe.thermalcorrgfe: 0.281895 hartree
zpe.sumelectzpe: -992.397793 hartree
zpe.sumelectthermal: -992.376466 hartree
zpe.sumelectthermalent: -992.375522 hartree
zpe.sumelectthermalfe: -992.449458 hartree
dipole: -0.0666 5.0473 0.7131
dipole: 5.0979
quadrupole: -102.7293 -115.8774 -124.2225
quadrupole: -4.4552 10.0513 -2.5165
quadrupole: 11.5471 -1.6010 -9.9461 -4.4552 10.0513 -2.5165
hfenergy: -992.7313526 hartree
pointgroup: C01 [X(C15H20N2O4)]
dipole: 0.1642365 1.9768705 -0.2961144 debye
polarizability: 296.8849974|0.9258534|212.9366112|-11.3391868|8.2530073|112.0638897 unknown
InChI: InChI=1S/C15H20N2O4/c1-2-21-15(20)13-10-16-14-4-3-11(9-12(13)14)17(5-7-18)6-8-19/h3-4,9-10,16,18-19H,2,5-8H2,1H3
charge 0 multiplicity 1
41 atoms
O  -0.204341 -3.331328 0.196178
O  -6.180092 0.535006 -0.466201
O  4.239187 -0.113219 -0.719056
O  2.335723 -1.463791 -0.539327
N  -2.648854 -0.555885 0.09565
N  1.62196 3.108797 0.119942
C  -1.658865 0.443253 0.065852
C  0.700692 1.040065 -0.1672
C  0.396262 2.404556 0.129849
C  -2.27278 -1.944346 -0.245593
C  -4.059512 -0.240926 0.353063
C  -0.320073 0.07823 -0.238429
C  2.142073 0.940062 -0.329674
C  -1.94466 1.827321 0.357565
C  -0.932156 2.807804 0.381958
C  2.66462 2.234458 -0.153742
C  -1.33922 -2.638315 0.812322
C  -4.81079 0.228851 -0.909246
C  2.861617 -0.309221 -0.534388
C  5.067259 -1.346294 -0.872387
C  5.464559 -1.912268 0.494518
H  -1.756514 -1.989014 -1.22641
H  -3.208787 -2.518544 -0.356673
H  -4.153601 0.538019 1.131396
H  -4.567007 -1.138809 0.747568
H  -0.051105 -0.936077 -0.521728
H  -2.970975 2.143745 0.565275
H  -1.190817 3.85015 0.599074
H  1.72911 4.10439 0.30482
H  3.700634 2.562674 -0.192839
H  -1.012219 -1.885467 1.55617
H  -1.895488 -3.429832 1.341769
H  -4.31477 1.125599 -1.335793
H  -4.803919 -0.576628 -1.674104
H  0.561606 -2.714754 0.037055
H  -6.724619 0.826102 -1.23928
H  4.493793 -2.08583 -1.45811
H  5.941905 -1.001008 -1.44725
H  6.142921 -2.775378 0.359171
H  5.988604 -1.152235 1.099808
H  4.574344 -2.258009 1.045924
