program: Gaussian 09
title: 000251792
version: EM64L-G09RevD.01
frameworkgroup: C1[X(C13H22N2O5)]
method: RPBEPBE
basis: SDD
operation: Freq
keyword: #p
keyword: freq=noraman
keyword: PBEPBE/SDD
title: #p freq=noraman PBEPBE/SDD
converged: YES YES NO NO
title: Mulliken charges:
elementType: O O O O O N N C C C C C C C C C C C C C H H H H H H H H H H H H H H H H H H H H H H
charge: -0.269735 -0.314306 -0.240241 -0.439424 -0.267237 -0.409385 -0.365194 0.231875 -0.497498 -0.604064 -0.420804 -0.423107 0.200885 0.280583 -0.179619 -0.355179 -0.777053 0.249998 -0.262531 -0.663468 0.277012 0.222946 0.274729 0.232988 0.225548 0.215518 0.217981 0.217936 0.309313 0.375803 0.269681 0.232275 0.197667 0.258657 0.255030 0.214164 0.366296 0.228340 0.237908 0.254417 0.221538 0.219757
chargesum: 0.00000
title: Mulliken charges with hydrogens summed into heavy atoms:
elementType: O O O O O N N C C C C C C C C C C C C C
charge: -0.269735 -0.314306 -0.240241 -0.073127 -0.267237 -0.100072 0.010608 0.231875 0.002461 -0.096347 0.020261 0.012810 0.200885 0.280583 0.090062 0.074763 -0.049202 0.249998 0.203716 0.032244
polarizability: 1.87123177e+02 -3.66521719e+00 1.67148919e+02 -1.18629595e+01 1.71153216e+00 1.49643437e+02
1716.lowfreq: -8.0325 -0.0006 -0.0001 0.0006 3.5153 9.5450 15.0577 25.1385 32.4722
frequency: 14.6553 24.6184 32.2491 57.7726 58.1802 59.6408 66.1958 72.7508 84.7082 101.5478 105.5318 130.6091 147.0170 182.2309 189.6761 214.8324 224.9749 255.9564 272.2590 290.5580 320.1149 334.6091 348.1250 352.5893 368.5470 411.6350 448.6855 489.8084 555.1760 557.9416 601.7484 603.3953 609.7341 642.9398 660.5156 704.0208 713.9370 736.4876 770.4194 799.8172 815.6939 818.4275 827.3488 846.6392 881.8933 885.5673 899.5186 913.8435 943.9635 964.6981 973.8430 989.9582 1006.0159 1022.0650 1039.0445 1041.0787 1044.5388 1059.1088 1080.2408 1095.9693 1106.3044 1140.1433 1156.6390 1161.4567 1191.0486 1198.1684 1202.6253 1226.3175 1232.5067 1259.7667 1277.2969 1277.9676 1287.3679 1291.8703 1303.3952 1311.3884 1314.3581 1328.9492 1351.1425 1357.5240 1387.7085 1389.3166 1391.5226 1448.0828 1455.6396 1457.1775 1459.3619 1463.6546 1467.1367 1471.7184 1474.9831 1482.6284 1486.9490 1496.4119 1524.8206 1586.3785 1602.9314 1613.6743 2965.7038 2991.7983 2996.4530 2996.8264 3010.5810 3011.6776 3012.7615 3021.6925 3035.0498 3049.4102 3073.8619 3087.0509 3091.9302 3092.1592 3094.4442 3095.7856 3101.1219 3101.1885 3122.3310 3247.3965 3487.0659 3530.5961
redmass: 4.5231 4.4839 4.0930 4.5088 2.3730 1.8701 2.4915 6.0690 2.0366 2.4064 4.9183 4.1982 4.1848 2.3372 2.7548 1.7289 3.1486 3.6761 3.4591 4.5741 3.4320 3.3521 4.0479 5.7589 3.7054 3.7295 3.2883 3.6297 1.4042 1.4412 2.1493 3.1263 2.1381 3.0372 5.8844 2.8821 5.9396 3.7005 2.1897 1.8140 1.6365 2.0538 2.5179 1.1928 3.2124 3.0130 2.5778 3.0511 2.5459 2.2387 2.3205 1.5715 2.7489 4.3862 1.8055 1.6658 1.7526 3.4434 2.4396 2.1664 2.5713 2.9199 1.8258 2.5572 1.4470 1.4046 1.3991 1.1706 1.6882 2.2277 1.1267 1.6421 1.4759 1.4348 1.4223 1.4767 1.5216 1.5734 1.2822 1.3117 1.2293 1.2025 1.2308 1.0511 1.0861 1.2835 1.1029 1.0510 1.0861 1.2285 1.0968 1.0678 1.2162 1.1950 1.7833 6.1614 7.8178 4.2418 1.0686 1.0357 1.0365 1.0610 1.0623 1.0814 1.0663 1.0679 1.0598 1.1011 1.1020 1.0979 1.0982 1.0961 1.1021 1.0980 1.1009 1.1007 1.1071 1.0860 1.0650 1.0775
irintensity: 0.1976 0.0712 0.5290 5.7536 4.5191 0.4224 0.7482 2.1999 2.9883 0.7487 5.5231 3.6133 6.2462 8.6905 5.4087 5.6904 8.0757 1.7492 17.2419 4.9628 0.2991 4.6816 23.4524 5.4731 1.0139 0.8592 9.4447 21.7946 163.5024 80.1038 8.4338 37.1055 67.7535 0.4074 7.8862 6.7170 9.8134 5.5796 6.1438 2.4170 5.4662 4.7520 2.5698 125.4166 11.7016 6.6468 3.6541 2.6941 7.4739 0.3181 89.8671 1.1350 39.0622 2.4157 0.7943 12.1136 4.0050 73.1352 5.7084 26.3002 37.4749 9.9769 19.5116 186.6704 5.8363 6.0779 60.6498 4.5233 13.8666 32.5211 2.6485 24.9749 28.2477 4.6182 0.3459 27.6653 41.4060 4.1760 20.1424 9.6881 47.4310 50.9443 11.0253 20.8927 15.6901 106.4095 38.3673 14.9670 11.3080 56.4384 17.2349 42.5946 22.8120 12.7446 243.5406 60.1447 318.5228 123.9770 66.2838 15.8455 6.7912 23.6952 60.4789 37.8514 30.6186 22.7232 29.2380 4.9112 30.5997 44.6945 12.7781 28.5879 4.1120 7.7792 16.4806 22.5157 24.6208 286.7413 38.9701 17.4264
temp: 298.150 k
press: 1.00000 atm
elementType: 8 8 8 8 8 7 7 6 6 6 6 6 6 6 6 6 6 6 6 6 1 1 1 1 1 1 1 1 1 1 1 1 1 1 1 1 1 1 1 1 1 1
symmnumber: 1
zpe: 912863.7 jmol-1
zpe.correction: 0.347691 hartree
zpe.thermalcorrener: 0.369905 hartree
zpe.thermalcorrenthalpy: 0.370849 hartree
zpe.thermalcorrgfe: 0.293230 hartree
zpe.sumelectzpe: -992.662646 hartree
zpe.sumelectthermal: -992.640433 hartree
zpe.sumelectthermalent: -992.639489 hartree
zpe.sumelectthermalfe: -992.717107 hartree
dipole: 2.0213 5.1365 -2.1016
dipole: 5.9065
quadrupole: -105.2864 -108.6173 -135.3588
quadrupole: -1.9924 7.6474 -1.5220
quadrupole: 11.1344 7.8035 -18.9380 -1.9924 7.6474 -1.5220
hfenergy: -993.0103375 hartree
pointgroup: C01 [X(C13H22N2O5)]
dipole: 1.0068358 -1.7633348 1.12999 debye
polarizability: 183.2943736|7.7115192|169.3469664|13.6965234|1.9950173|151.2741932 unknown
InChI: InChI=1S/C13H22N2O5/c1-3-20-11(18)10(8-16)14-12(19)13(15-9(2)17)6-4-5-7-13/h10,14-16H,3-8H2,1-2H3
charge 0 multiplicity 1
42 atoms
O  0.05377 1.816582 1.663346
O  0.584143 -1.204759 -1.777802
O  -2.838898 -0.717632 0.921403
O  -2.343189 1.717198 -2.627844
O  -3.818996 -0.171249 -1.118715
N  1.758518 -0.920812 0.221782
N  -0.644321 0.807317 -0.317907
C  1.736005 0.571372 0.332633
C  2.368542 1.241868 -0.928567
C  2.73714 0.968963 1.445961
C  3.899195 1.038408 -0.757189
C  4.144343 0.897803 0.784349
C  0.302036 1.111521 0.634935
C  1.249486 -1.691849 -0.800715
C  -2.028854 1.273412 -0.183759
C  -2.417893 2.289117 -1.28501
C  1.5213 -3.189083 -0.708325
C  -2.990348 0.073733 -0.201077
C  -3.646011 -1.980909 0.977226
C  -2.898992 -3.117784 0.275085
H  1.973648 0.830617 -1.870604
H  2.111571 2.31727 -0.896373
H  2.487675 1.994757 1.76195
H  2.637624 0.337188 2.348358
H  4.226586 0.124863 -1.285202
H  4.462684 1.882148 -1.192511
H  4.797925 1.698641 1.172349
H  4.648654 -0.060105 1.010015
H  2.220318 -1.408106 0.992935
H  -0.361833 0.239008 -1.140815
H  -2.089531 1.763066 0.808446
H  -1.695374 3.120828 -1.273534
H  -3.433248 2.686042 -1.07132
H  2.123072 -3.49802 -1.580813
H  0.563114 -3.73327 -0.766124
H  2.051807 -3.488936 0.211702
H  -3.028135 0.995468 -2.666512
H  -3.763566 -2.161497 2.057097
H  -4.62751 -1.790253 0.509421
H  -2.784021 -2.908157 -0.801684
H  -1.89927 -3.263112 0.720604
H  -3.468167 -4.059354 0.385405
