program: Gaussian 09
title: 000251755
version: EM64L-G09RevD.01
frameworkgroup: C1[X(C6H14Cl2NO3P)]
method: RPBEPBE
basis: SDD
operation: Freq
keyword: #p
keyword: freq=noraman
keyword: PBEPBE/SDD
title: #p freq=noraman PBEPBE/SDD
converged: YES YES NO NO
title: Mulliken charges:
elementType: Cl Cl P O O O N C C C C C C H H H H H H H H H H H H H H
charge: -0.052230 -0.056780 1.332550 -0.514016 -0.673091 -0.573515 -0.535509 -0.279992 -0.313252 -0.568327 -0.561067 -0.215330 -0.658142 0.244064 0.268529 0.238154 0.283335 0.277339 0.268613 0.294418 0.264242 0.232385 0.214003 0.396450 0.213592 0.229701 0.243875
chargesum: 0.00000
title: Mulliken charges with hydrogens summed into heavy atoms:
elementType: Cl Cl P O O O N C C C C C C
charge: -0.052230 -0.056780 1.332550 -0.514016 -0.276641 -0.573515 -0.535509 0.232601 0.208237 -0.022375 -0.002406 0.231058 0.029026
polarizability: 1.50520346e+02 5.65433509e+00 1.27885440e+02 2.06541398e+00 1.12674949e+00 9.74888026e+01
1716.lowfreq: -14.7937 -8.7112 -4.8720 -0.0014 -0.0009 0.0025 8.6073 33.4452 35.0142
frequency: -4.2099 33.3452 34.9104 55.5177 68.7453 82.0854 95.5128 98.4736 132.7050 190.5005 200.2482 209.7780 212.8030 216.5236 247.1286 266.1795 294.0880 313.8547 379.2134 386.4781 408.1886 421.2543 491.4935 603.1916 671.1234 692.0353 712.2533 721.1719 769.1149 779.3690 804.5674 880.1155 950.1321 995.3775 998.1094 1015.8912 1032.1911 1044.6964 1059.0264 1077.4353 1103.6002 1110.6762 1129.8847 1197.4085 1232.3756 1250.5880 1253.9135 1258.0500 1290.6352 1329.0280 1349.5565 1354.0166 1366.6240 1397.6513 1448.2322 1457.5024 1458.9666 1467.5841 1474.1505 1476.6931 1489.1606 2991.0208 2996.0503 3006.1904 3025.0988 3057.8171 3060.0713 3065.5730 3081.5855 3091.4381 3092.9821 3110.0285 3145.5912 3153.3448 3587.5572
redmass: 6.4375 6.7151 5.3277 5.5415 6.8631 2.3427 2.2926 2.0450 4.2585 3.4495 6.1780 7.8482 4.2022 4.6927 1.3854 4.2920 3.7579 3.0884 2.7450 1.8818 4.3199 3.8610 6.7231 6.0496 7.6012 5.8570 4.4112 8.6416 1.1584 1.1774 1.0998 4.0332 2.8303 1.4811 1.6638 2.4539 2.4553 2.4284 2.8075 2.7698 2.2626 1.7501 1.4256 2.1209 1.6070 1.1556 1.1660 1.1602 1.1467 1.2014 1.2215 1.2550 1.2539 1.2377 1.0844 1.0587 1.0738 1.0888 1.0735 1.0592 1.0754 1.0522 1.0426 1.0635 1.0622 1.1059 1.0570 1.0578 1.1003 1.0985 1.1035 1.1018 1.1119 1.1116 1.0659
irintensity: 1.4472 1.2225 0.0605 1.8444 1.6659 3.1905 1.0901 2.1304 0.6484 0.4194 1.8320 0.7634 11.1727 5.7137 0.8512 11.9356 30.3689 9.3794 59.4735 50.7678 27.1096 72.7649 10.8191 16.6880 8.2877 70.0219 162.0573 207.9298 2.8209 12.4827 6.1837 169.9290 99.9676 2.9256 37.8445 88.3714 0.6047 16.8300 20.5650 166.7865 30.9306 54.0995 5.9485 57.7416 8.7717 1.1928 11.8364 5.7250 5.4619 11.0800 1.5014 6.4721 0.3992 26.5179 6.8156 8.6442 9.7123 32.3114 9.5242 0.9652 12.6151 22.4448 20.2732 15.9317 10.6574 20.9573 10.1848 18.0779 1.9469 31.8820 2.4916 37.2400 9.5457 15.2613 67.7002
temp: 298.150 k
press: 1.00000 atm
elementType: 17 17 15 8 8 8 7 6 6 6 6 6 6 1 1 1 1 1 1 1 1 1 1 1 1 1 1
symmnumber: 1
zpe: 544333.6 jmol-1
zpe.correction: 0.207326 hartree
zpe.thermalcorrener: 0.223887 hartree
zpe.thermalcorrenthalpy: 0.224831 hartree
zpe.thermalcorrgfe: 0.160937 hartree
zpe.sumelectzpe: -1777.716639 hartree
zpe.sumelectthermal: -1777.700077 hartree
zpe.sumelectthermalent: -1777.699133 hartree
zpe.sumelectthermalfe: -1777.763028 hartree
dipole: 2.2512 -1.0638 -3.2493
dipole: 4.0936
quadrupole: -106.9749 -103.7717 -106.1968
quadrupole: -5.0451 -5.0350 8.4158
quadrupole: -1.3271 1.8761 -0.5490 -5.0451 -5.0350 8.4158
hfenergy: -1777.9239647 hartree
pointgroup: C01 [X(C6H14Cl2N1O3P1)]
dipole: 0.9896768 0.1645663 -1.2598828 debye
polarizability: 137.4939599|12.5102349|140.8846414|1.7474038|2.071609|97.5159865 unknown
InChI: InChI=1S/C6H14Cl2NO3P/c1-2-12-13(10,11)9(5-3-7)6-4-8/h10H,2-6H2,1H3
charge 0 multiplicity 1
27 atoms
Cl -0.697293 3.997767 0.20327
Cl -4.147158 -2.071372 -0.445031
P  0.814397 -1.178055 0.427848
O  2.16065 -0.106884 0.504923
O  0.988812 -2.109927 -1.029688
O  0.675651 -2.075481 1.732146
N  -0.485708 -0.130739 -0.070456
C  -0.607615 1.220534 0.534389
C  -1.702328 -0.735686 -0.668852
C  -0.39457 2.290069 -0.547541
C  -2.581584 -1.42377 0.392823
C  2.884308 0.297661 -0.742293
C  3.743525 1.498998 -0.361779
H  -1.606821 1.34559 0.99232
H  0.140006 1.353076 1.334545
H  -2.27627 0.06588 -1.166953
H  -1.404983 -1.460777 -1.444401
H  0.638795 2.301571 -0.920078
H  -1.107897 2.198536 -1.37972
H  -2.090615 -2.298885 0.84374
H  -2.924916 -0.732638 1.177011
H  3.498481 -0.557627 -1.076871
H  2.152589 0.537527 -1.538133
H  1.27249 -3.043216 -0.851628
H  4.346661 1.818431 -1.231975
H  3.121062 2.349573 -0.034877
H  4.429435 1.236141 0.460564
