program: Gaussian 09
title: 000251786
version: EM64L-G09RevD.01
frameworkgroup: C1[X(C26H25N7O2)]
method: RPBEPBE
basis: SDD
operation: Freq
keyword: #p
keyword: freq=noraman
keyword: PBEPBE/SDD
title: #p freq=noraman PBEPBE/SDD
converged: YES YES NO NO
title: Mulliken charges:
elementType: O O N N N N N N N C C C C C C C C C C C C C C C C C C C C C C C C C C H H H H H H H H H H H H H H H H H H H H H H H H H
charge: -0.322282 -0.323453 -0.443931 -0.445234 -0.122147 -0.122621 -0.473582 -0.473472 -0.664200 -0.392249 -0.391689 0.120370 0.121086 -0.477148 -0.477031 0.380710 0.381677 0.492864 0.491645 -0.377710 -0.377985 -0.361055 -0.359411 0.131175 0.132167 0.150721 -0.344382 -0.474180 -0.343662 -0.475623 0.168712 0.169963 -0.342056 -0.339207 -0.322325 0.219625 0.227738 0.219463 0.227741 0.229419 0.228853 0.228760 0.229616 0.288957 0.288644 0.278365 0.278922 0.225935 0.223803 0.311520 0.217508 0.312186 0.217378 0.312460 0.312021 0.217363 0.214246 0.233862 0.380415 0.380746
chargesum: 0.00000
title: Mulliken charges with hydrogens summed into heavy atoms:
elementType: O O N N N N N N N C C C C C C C C C C C C C C C C C C C C C C C C C C
charge: -0.322282 -0.323453 -0.154974 -0.156590 -0.122147 -0.122621 -0.161122 -0.161451 0.096961 0.055114 0.055514 0.120370 0.121086 -0.018875 -0.018655 0.380710 0.381677 0.492864 0.491645 -0.099345 -0.099063 -0.135120 -0.135608 0.131175 0.132167 0.150721 -0.032862 -0.256672 -0.031477 -0.258245 0.168712 0.169963 -0.124692 -0.124962 -0.088463
polarizability: 8.10320194e+02 -1.40502005e+00 3.22466562e+02 -2.41063416e+00 3.37691732e+01 1.81419565e+02
1716.lowfreq: -8.8221 -2.1743 -0.0022 -0.0013 0.0019 1.4797 7.9141 16.7502 18.7221
frequency: 7.8427 16.4888 18.6725 24.3082 35.6475 48.6541 50.5604 56.0057 62.6230 73.8253 96.5920 103.5005 114.3873 118.0927 122.9827 130.7319 133.8329 137.1923 176.7567 192.6293 199.3426 227.6159 231.5193 270.0720 289.4313 331.1801 344.6105 356.1553 366.2655 370.9340 384.6778 393.1799 395.6244 408.6253 412.4431 414.5477 434.3214 448.3877 452.6915 469.9857 519.7505 521.9536 536.4206 539.3629 589.7655 625.8837 626.3167 633.4741 638.1228 642.5228 648.5161 651.5513 651.9468 674.4416 709.9814 724.5876 725.4735 726.8935 744.1851 745.2649 745.6853 784.3856 794.2579 809.7949 817.0626 821.4089 822.2732 831.1909 832.3413 836.9425 850.5445 860.3244 881.2623 882.0261 883.4282 883.9367 906.6015 917.8397 937.5781 937.6563 941.6724 942.7238 945.8724 946.3239 953.5844 1005.1303 1005.3678 1009.6011 1010.9623 1028.1173 1028.5398 1077.7159 1078.4033 1080.8233 1090.6508 1097.3882 1098.4803 1110.3067 1127.3838 1127.8716 1166.5888 1167.0524 1179.2799 1191.8517 1192.0449 1208.3503 1209.1360 1229.1744 1257.2144 1260.4172 1262.4872 1262.7103 1270.3077 1277.6140 1277.9533 1289.7275 1307.4354 1309.4566 1324.0964 1325.1807 1325.8135 1364.4949 1367.5433 1398.5933 1412.0636 1415.8378 1429.0719 1433.4136 1438.5699 1456.7064 1466.2341 1467.1336 1491.2284 1498.4722 1500.1981 1502.5082 1514.4130 1517.6478 1536.8289 1560.5594 1570.5308 1573.0468 1573.3475 1595.6854 1596.2339 1603.1335 1626.9234 1626.9748 1631.6041 2964.1422 2964.7792 2995.0559 2995.7689 3036.2823 3036.3152 3059.3156 3059.5526 3108.3918 3108.6208 3117.6357 3120.8115 3143.0564 3143.3113 3161.9887 3162.4485 3168.4846 3204.4957 3204.7487 3325.9682 3475.4596 3536.3754 3537.2709 3576.7831 3579.0928
redmass: 6.0819 4.6002 4.2840 6.1946 4.5829 5.0086 5.1276 4.3281 3.7998 5.6847 5.1574 4.9779 8.9760 5.4787 3.8198 3.4084 2.7958 2.7573 5.1471 4.6605 4.7282 5.0545 5.3230 5.4979 5.2314 6.4024 4.8308 4.2055 4.0524 4.9407 1.7687 6.1258 1.7438 4.2535 2.7261 3.0858 6.8200 3.4156 3.6272 4.0833 2.7639 2.7403 4.3664 3.1306 7.3896 5.2789 3.7124 3.5976 1.7953 2.0038 2.7407 3.9872 3.7186 5.5465 6.9583 3.9828 3.7451 4.2784 2.3159 4.0165 2.0492 6.6397 2.0756 1.1588 1.6622 1.4713 1.4560 1.4153 1.4005 4.8198 4.7689 7.0097 2.7807 5.3924 1.9858 1.4906 4.1564 1.5442 3.1571 3.0302 1.4945 1.4796 5.1895 5.5047 1.3789 2.9195 2.9172 1.3661 1.3816 3.3865 3.3786 1.8832 1.7193 3.4820 2.5723 2.4280 2.2490 2.2063 1.4587 1.4781 1.1401 1.1399 1.1878 1.1304 1.1281 1.1034 1.1001 2.7304 1.9639 2.1425 1.2803 1.2666 2.8088 1.6132 1.6385 1.6407 1.3629 1.4679 2.2128 1.7544 1.9488 4.5349 4.6475 7.3717 4.2901 3.9052 2.4350 2.4161 2.6248 2.4422 1.1340 1.1345 2.1875 1.5762 1.2298 1.4152 2.5839 2.8061 3.2957 6.3923 5.0247 5.6564 4.2721 5.2516 4.8639 1.7839 6.2311 6.0890 5.7689 1.0648 1.0646 1.0655 1.0653 1.0965 1.0963 1.1042 1.1044 1.0883 1.0883 1.0869 1.0908 1.0950 1.0950 1.0914 1.0914 1.0974 1.0946 1.0946 1.0451 1.1097 1.0755 1.0755 1.0787 1.0788
irintensity: 1.3074 1.3392 1.4933 0.0867 1.0430 1.6608 1.8369 0.8633 2.4126 0.5215 2.9257 0.5690 7.6237 0.7758 1.0518 2.6560 0.6501 4.4423 6.8323 0.9310 7.1191 2.2213 0.8730 2.7101 38.5413 9.4490 13.1824 38.9457 15.5670 7.8199 91.7304 19.8511 73.2847 1.1482 15.8094 12.9260 3.3629 13.3901 4.4759 97.5238 41.4061 9.7151 2.5631 3.0746 1.2370 14.8360 13.0107 8.1593 33.5218 26.9667 28.6673 54.0092 4.0263 31.0136 32.5214 1.2334 5.7844 2.0832 5.1448 2.1197 39.4734 1.0315 85.1030 41.0098 145.5186 65.0034 60.9379 1.3797 1.5909 3.7185 2.2710 0.1175 15.1714 2.1114 19.2557 87.8213 51.6049 27.6164 4.2520 2.6258 0.2512 0.1588 20.4793 32.3332 0.2998 3.2979 9.3413 0.4123 0.6165 8.8148 3.9057 2.3164 4.5652 7.6803 368.3547 18.4473 7.4629 19.6571 1.6670 11.4013 6.3245 6.2406 12.1404 35.7888 19.9909 0.6313 0.4985 488.9662 23.9099 18.7348 9.4304 49.8698 17.0577 21.4089 89.2590 492.7466 59.8883 4.3241 2.6093 105.8962 3.5660 583.6125 31.0413 46.0985 13.7434 21.5013 109.3221 899.4689 18.8242 60.5314 0.9397 0.5255 332.0446 22.4960 275.2830 55.6008 693.6718 16.0097 227.4713 0.5223 21.9260 362.5593 32.8196 39.0911 55.3585 59.1487 88.5972 35.4967 170.8799 104.6074 94.2319 79.7725 78.0322 85.0070 22.0303 51.2626 50.9194 27.5239 23.8695 2.4017 34.3473 18.4846 18.9602 0.1946 0.1898 15.3826 4.5163 4.7433 78.3658 585.4462 9.8944 10.5721 9.7004 9.7850
temp: 298.150 k
press: 1.00000 atm
elementType: 8 8 7 7 7 7 7 7 7 6 6 6 6 6 6 6 6 6 6 6 6 6 6 6 6 6 6 6 6 6 6 6 6 6 6 1 1 1 1 1 1 1 1 1 1 1 1 1 1 1 1 1 1 1 1 1 1 1 1 1
symmnumber: 1
zpe: 1242871.3 jmol-1
zpe.correction: 0.473385 hartree
zpe.thermalcorrener: 0.503960 hartree
zpe.thermalcorrenthalpy: 0.504905 hartree
zpe.thermalcorrgfe: 0.406758 hartree
zpe.sumelectzpe: -1537.058745 hartree
zpe.sumelectthermal: -1537.028169 hartree
zpe.sumelectthermalent: -1537.027225 hartree
zpe.sumelectthermalfe: -1537.125371 hartree
dipole: -0.5420 8.9007 4.0189
dipole: 9.7810
quadrupole: -142.3348 -193.3262 -208.2430
quadrupole: -11.3039 24.1076 3.3101
quadrupole: 38.9665 -12.0249 -26.9416 -11.3039 24.1076 3.3101
hfenergy: -1537.5321293 hartree
pointgroup: C01 [X(C26H25N7O2)]
dipole: 0.2098451 -0.1884018 3.8377968 debye
polarizability: 810.2692623|5.5116436|183.3856897|3.1711854|-37.4980343|320.5513675 unknown
InChI: InChI=1S/C26H25N7O2/c27-22-20(25(34)32-18-8-4-16(5-9-18)23-28-12-13-29-23)2-1-3-21(22)26(35)33-19-10-6-17(7-11-19)24-30-14-15-31-24/h1-11,28,30,32-33H,12-15,27H2
charge 0 multiplicity 1
60 atoms
O  -2.665259 -0.103998 -1.466884
O  2.652951 -0.02719 -1.454255
N  -10.040701 1.306198 0.745554
N  10.127763 0.909702 0.737578
N  -9.771425 0.725108 -1.472303
N  9.617373 1.519164 -1.429039
N  -3.63021 -0.231902 0.66017
N  3.621547 -0.161173 0.670182
N  -0.006423 0.060548 -1.539611
C  -11.361706 1.660876 0.170056
C  11.47302 1.144584 0.158142
C  -9.190735 0.875346 -0.292367
C  9.159635 1.06082 -0.274557
C  -11.216942 1.083164 -1.288186
C  11.091716 1.734112 -1.252022
C  -7.761981 0.58737 -0.042426
C  7.734896 0.75256 -0.025527
C  -4.992979 0.044775 0.366511
C  4.977098 0.151254 0.378946
C  -6.87392 0.4485 -1.140901
C  6.839716 0.651104 -1.122357
C  -7.242724 0.440319 1.270839
C  7.224093 0.558734 1.284962
C  -1.249058 -0.74729 0.413701
C  1.249004 -0.717698 0.418595
C  -0.00198 -0.458361 -0.278372
C  -5.505728 0.18528 -0.954061
C  -5.87738 0.171676 1.472926
C  5.477847 0.355574 -0.937906
C  5.864455 0.261146 1.484866
C  -2.547324 -0.352507 -0.214902
C  2.539742 -0.290978 -0.204816
C  -1.208412 -1.426449 1.655468
C  1.218142 -1.39804 1.66035
C  0.007979 -1.775633 2.275278
H  -11.516822 2.759123 0.166007
H  -12.189716 1.191614 0.729892
H  12.044537 0.198086 0.069913
H  12.061207 1.853648 0.766924
H  -11.826549 0.168823 -1.418144
H  -11.528493 1.804736 -2.063598
H  11.64472 1.251908 -2.077079
H  11.298916 2.820046 -1.300998
H  -9.688464 1.763242 1.585782
H  9.993766 0.292886 1.537683
H  -7.285979 0.553095 -2.149435
H  7.240561 0.816226 -2.127319
H  -7.906661 0.497803 2.140686
H  7.875396 0.672412 2.158781
H  -4.826814 0.096732 -1.80263
H  -5.494307 0.050819 2.494802
H  4.794494 0.288232 -1.784839
H  5.48503 0.119739 2.505479
H  -3.411716 -0.303157 1.655736
H  3.407832 -0.255183 1.664814
H  -2.142367 -1.749559 2.131665
H  2.156679 -1.699767 2.141525
H  0.012795 -2.344795 3.208894
H  -0.919472 0.163649 -2.002564
H  0.905839 0.190745 -1.997507
