program: Gaussian 09
title: 000251797
version: EM64L-G09RevD.01
frameworkgroup: C1[X(C23H17N3O2S)]
method: RPBEPBE
basis: SDD
operation: Freq
keyword: #p
keyword: freq=noraman
keyword: PBEPBE/SDD
title: #p freq=noraman PBEPBE/SDD
converged: YES YES NO NO
title: Mulliken charges:
elementType: S O O N N N C C C C C C C C C C C C C C C C C C C C C C C H H H H H H H H H H H H H H H H H
charge: 0.194788 -0.492922 -0.452610 -0.395903 -0.035119 -0.117061 -0.366781 0.412477 0.385609 -0.009623 -0.389593 -0.111728 0.494008 0.083134 -0.462183 -0.216767 -0.350098 -0.352074 -0.272323 -0.326553 -0.302398 0.369162 -0.214825 -0.176546 -0.367528 -0.283239 -0.344657 -0.248013 -0.212996 0.310315 0.325796 0.251868 0.241131 0.237139 0.245456 0.222475 0.255660 0.224541 0.400243 0.236216 0.253404 0.240707 0.256380 0.407049 0.226645 0.227341
chargesum: 0.00000
title: Mulliken charges with hydrogens summed into heavy atoms:
elementType: S O O N N N C C C C C C C C C C C C C C C C C C C C C C C
charge: 0.194788 -0.092679 -0.045562 -0.070108 -0.035119 -0.117061 -0.056466 0.412477 0.385609 -0.009623 -0.137725 -0.111728 0.494008 0.083134 -0.221052 -0.216767 -0.112958 -0.106618 -0.049848 -0.070893 -0.302398 0.369162 0.009716 0.059670 -0.114124 -0.042533 -0.088277 -0.021368 0.014345
polarizability: 4.32938827e+02 3.00058119e+01 2.36463038e+02 -4.61139971e+00 2.24252820e+01 2.58177601e+02
1716.lowfreq: -1.9743 -0.0017 -0.0012 -0.0011 2.7772 5.0758 13.4526 28.8135 34.9329
frequency: 13.3990 28.8067 34.9149 37.1974 40.8222 68.9634 99.1625 117.1109 132.7582 164.6497 167.9274 183.2208 185.2658 211.4592 233.0117 244.5805 269.6710 276.6459 315.4014 330.3386 348.8109 384.8504 417.2766 428.3163 431.3199 434.9816 469.2255 481.9227 486.9240 495.5659 506.5361 519.4333 531.3671 544.7992 562.0904 567.3737 573.3332 586.2126 593.3062 618.4296 640.6884 649.5948 668.4301 677.6141 686.4691 713.3663 727.1651 732.4518 758.8982 759.0925 765.8150 780.9317 789.9726 800.9108 812.4251 831.4483 848.1851 858.0681 866.7936 871.9277 883.4442 936.7947 937.9426 946.3556 948.4539 963.0885 975.8564 977.3534 992.4250 1014.4203 1033.4127 1034.8687 1036.1933 1049.5734 1071.7671 1095.6083 1116.4382 1146.1575 1152.3744 1163.3935 1168.4348 1176.1714 1182.5453 1202.9265 1224.4161 1225.8704 1241.8636 1248.9592 1250.8974 1270.5410 1293.8668 1302.9123 1329.6693 1359.9896 1365.5972 1371.2084 1372.9228 1410.6780 1415.1412 1435.7850 1445.3580 1446.3231 1454.1270 1456.8312 1467.3554 1472.9113 1500.7608 1565.1492 1568.7864 1582.4859 1587.7275 1591.4829 1621.4532 1629.3291 1649.7531 2989.2064 3125.6879 3126.6118 3133.7447 3136.7344 3137.7641 3144.6837 3147.9887 3151.3433 3156.3340 3163.3366 3171.2134 3174.6985 3175.1005 3256.3535 3315.0727 3577.6157
redmass: 6.2679 6.7195 6.0730 6.0539 5.7301 5.6050 6.2388 5.6895 6.6149 5.2564 6.3618 6.0782 6.7514 6.0993 5.2212 4.9496 5.4443 5.1582 5.4235 4.7687 4.5891 1.4873 5.4155 4.2725 3.2102 4.1797 3.7880 9.1553 5.8717 6.8124 5.1026 5.3174 4.4641 4.5152 4.8813 5.4463 3.9505 6.0589 7.0462 7.0651 2.2114 1.7107 6.6951 5.8757 4.1388 5.6668 2.7704 3.8836 1.2746 1.4945 1.4090 1.6875 1.9554 4.0104 4.3967 4.5197 1.6948 1.3815 1.6001 5.8545 6.1599 1.3954 2.9868 1.4516 1.4251 1.3583 1.3034 1.3121 1.3840 2.7115 2.7847 3.7985 2.1269 3.8503 3.3097 2.5649 1.5887 1.3558 2.0743 1.1620 1.1069 1.5100 1.9196 2.0816 1.8070 1.7375 3.0489 1.8529 1.8348 1.6147 2.3097 1.8911 1.4896 1.8477 2.8319 2.2755 4.2969 2.0234 1.9235 2.9548 2.7920 6.4608 2.3520 3.4277 1.5366 2.8191 3.6729 6.6824 7.0917 7.4399 6.4021 6.1552 6.4679 8.8045 6.8652 1.0835 1.0863 1.0856 1.0853 1.0900 1.0883 1.0924 1.0905 1.0967 1.0951 1.0957 1.0988 1.0992 1.0989 1.0634 1.0702 1.0778
irintensity: 0.1279 0.3394 1.7398 0.2158 0.4002 1.6605 1.0496 3.1195 3.7006 2.8532 1.0859 0.3080 5.4275 0.7869 7.7697 3.0146 1.2775 3.6732 1.3737 1.6976 15.3205 109.3592 8.1404 0.0866 5.7742 1.0797 19.2912 2.1264 6.4842 2.2377 0.2962 16.7288 2.4691 1.3879 27.8695 9.0427 7.3661 3.2883 3.4542 4.7757 63.8829 116.6640 6.5498 4.4517 15.5926 35.8380 16.0388 7.5924 131.4531 70.9296 38.8522 27.2927 35.2329 25.6387 16.0834 10.4308 47.1750 1.3433 1.1639 3.8217 9.7357 2.9830 9.0327 0.1637 1.9940 1.3706 0.1409 0.1267 0.8735 19.5517 3.0155 10.6306 9.9792 11.0445 17.3614 31.9573 35.4131 5.9162 57.6994 38.5533 5.2199 25.7140 45.3808 77.3090 27.1888 92.7046 17.7279 20.5717 12.9571 69.0642 31.0076 24.3204 19.8928 31.7782 38.8278 60.7830 1.4948 21.5781 2.5764 21.1766 60.4947 27.6468 1.9690 17.0909 318.1734 47.9113 44.1487 145.9845 10.4185 286.4279 42.6378 3.8282 42.2304 345.2847 25.8414 2.8793 3.2295 3.2022 1.9023 14.3758 4.0687 16.0516 12.0291 10.4457 25.9542 23.4750 22.4361 19.3484 27.8388 286.4292 416.7608 82.2505
temp: 298.150 k
press: 1.00000 atm
elementType: 16 8 8 7 7 7 6 6 6 6 6 6 6 6 6 6 6 6 6 6 6 6 6 6 6 6 6 6 6 1 1 1 1 1 1 1 1 1 1 1 1 1 1 1 1 1
symmnumber: 1
zpe: 908128.8 jmol-1
zpe.correction: 0.345888 hartree
zpe.thermalcorrener: 0.369130 hartree
zpe.thermalcorrenthalpy: 0.370074 hartree
zpe.thermalcorrgfe: 0.291333 hartree
zpe.sumelectzpe: -1597.445844 hartree
zpe.sumelectthermal: -1597.422602 hartree
zpe.sumelectthermalent: -1597.421658 hartree
zpe.sumelectthermalfe: -1597.500399 hartree
dipole: -5.4458 -3.5579 -2.8217
dipole: 7.0907
quadrupole: -134.5905 -176.7206 -166.3240
quadrupole: 11.3489 3.6378 1.6019
quadrupole: 24.6212 -17.5089 -7.1123 11.3489 3.6378 1.6019
hfenergy: -1597.7917317 hartree
pointgroup: C01 [X(C23H17N3O2S1)]
dipole: 2.2730864 1.0968704 -1.1883944 debye
polarizability: 436.1960632|15.4184347|228.1987661|5.4548032|-18.8770067|263.1846364 unknown
InChI: InChI=1S/C23H17N3O2S/c27-18-9-3-1-7-15(18)21(26-23-25-17-8-2-4-10-19(17)29-23)16-12-11-14-6-5-13-24-20(14)22(16)28/h1-13,21,26-28H
charge 0 multiplicity 1
46 atoms
S  -3.057727 2.094536 -1.789981
O  2.021477 0.27238 2.014612
O  0.724463 -2.17436 1.999781
N  -0.75316 0.706832 -0.9789
N  -2.718432 0.470596 0.366721
N  4.589335 0.837346 1.6066
C  0.083261 -0.139484 -0.098211
C  1.557167 0.165896 -0.376099
C  -0.208774 -1.643337 -0.257088
C  2.442903 0.364845 0.684365
C  2.095796 0.209109 -1.707254
C  3.828635 0.651229 0.465398
C  4.344316 0.724809 -0.874389
C  0.127448 -2.549183 0.792494
C  3.441716 0.488269 -1.962254
C  -2.065283 0.964442 -0.663677
C  -0.807677 -2.157595 -1.430138
C  -0.152432 -3.930632 0.653763
C  -1.076958 -3.534486 -1.576755
C  5.740857 1.018632 -1.000272
C  -4.451516 1.799613 -0.652284
C  -4.055228 0.910771 0.403792
C  -0.747981 -4.421564 -0.524106
C  6.511916 1.212307 0.151631
C  5.89779 1.11267 1.441798
C  -5.752149 2.325682 -0.731449
C  -5.00144 0.550092 1.390856
C  -6.684267 1.953195 0.267456
C  -6.309266 1.074099 1.315924
H  -0.149385 0.1494 0.946125
H  -0.289244 1.302257 -1.663697
H  1.426615 -0.011948 -2.547479
H  3.816872 0.512492 -2.991065
H  -1.09479 -1.455371 -2.221005
H  0.108086 -4.593314 1.484704
H  -1.550835 -3.908442 -2.490334
H  6.193994 1.087309 -1.995609
H  -0.958536 -5.492858 -0.617676
H  2.842989 0.456155 2.572131
H  7.58043 1.436903 0.084936
H  6.488831 1.258283 2.352221
H  -6.04602 3.003288 -1.538971
H  -4.698771 -0.130042 2.192386
H  1.045392 -1.226415 2.053513
H  -7.704191 2.350002 0.224799
H  -7.045723 0.797289 2.078084
