program: Gaussian 09
title: 000251800
version: EM64L-G09RevD.01
frameworkgroup: C1[X(C20H30ClNO2)]
method: RPBEPBE
basis: SDD
operation: Freq
keyword: #p
keyword: freq=noraman
keyword: PBEPBE/SDD
title: #p freq=noraman PBEPBE/SDD
converged: NO YES NO NO
title: Mulliken charges:
elementType: Cl O O N C C C C C C C C C C C C C C C C C C C C H H H H H H H H H H H H H H H H H H H H H H H H H H H H H H
charge: -0.065651 -0.473041 -0.244195 -0.096156 -0.059551 0.154530 -0.119038 -0.448808 -0.474864 -0.409889 -0.414437 -0.382105 -0.406568 0.361356 -0.740668 -0.335105 -0.344808 -0.379950 -0.374149 -0.331894 -0.322924 -0.251670 -0.216369 -0.114970 0.187571 0.203186 0.215431 0.224090 0.217132 0.178451 0.202321 0.188932 0.192420 0.200768 0.200938 0.189490 0.194325 0.236285 0.224485 0.219778 0.239850 0.331621 0.202730 0.188626 0.187512 0.215532 0.236505 0.291147 0.215063 0.192192 0.193457 0.215065 0.253327 0.252689
chargesum: 0.00000
title: Mulliken charges with hydrogens summed into heavy atoms:
elementType: Cl O O N C C C C C C C C C C C C C C C C C C C C
charge: -0.065651 -0.141419 -0.244195 -0.096156 0.128020 0.154530 0.084148 -0.009287 -0.079280 -0.018636 -0.021248 0.008323 0.024042 0.361356 -0.056555 0.056251 0.058236 -0.143444 -0.083002 0.075362 0.085598 0.001658 0.036320 -0.114970
polarizability: 2.70243394e+02 3.15044174e+01 2.32355704e+02 2.94463266e+00 9.78897334e+00 1.98859421e+02
1716.lowfreq: -20.0183 -13.4709 0.0014 0.0016 0.0016 1.2972 18.0495 28.7664 32.6306
frequency: 17.8713 27.9751 31.4459 43.9416 62.5550 64.9957 73.8583 111.2734 119.0469 143.9882 152.9494 181.0485 196.3579 211.3224 229.9288 235.9099 246.4712 261.2179 272.1799 289.4590 297.3546 308.6699 319.4083 332.0245 345.0432 366.1506 389.1655 399.7452 412.7657 428.9992 434.7617 457.8578 468.4195 474.2942 484.7416 505.0026 532.2999 595.5723 623.2011 626.2455 681.5006 726.1765 735.0054 772.3175 785.0589 794.5411 809.0739 828.8429 841.4412 842.8665 845.4993 862.7171 869.2749 889.5157 892.2380 904.8367 921.7382 930.6698 951.3668 963.0105 979.5671 990.3343 1000.0658 1002.6818 1027.3898 1049.2040 1051.6333 1054.5082 1056.1972 1058.1384 1074.5089 1077.2185 1087.3883 1096.6447 1109.1493 1112.4264 1117.5483 1133.9854 1137.2333 1142.6668 1149.6956 1166.7678 1187.6385 1189.5617 1191.9838 1229.3954 1231.7411 1246.8423 1257.7261 1265.9383 1271.4248 1286.3143 1291.3354 1295.3854 1297.8835 1307.8892 1319.5262 1322.7203 1331.6599 1334.1933 1336.9184 1342.3792 1343.5119 1352.0255 1360.8583 1364.3827 1369.5775 1372.1770 1376.0731 1389.0143 1393.4491 1442.9061 1447.0390 1451.3345 1456.2179 1460.3263 1463.1833 1464.1558 1469.6555 1472.0976 1476.6482 1478.4279 1481.5456 1485.9146 1582.8465 1598.5378 2846.9325 2852.3490 2867.7545 2939.0164 2953.7552 2954.5276 2958.3507 2962.7007 2965.1864 2967.4873 2968.7822 2986.6242 2990.6851 3021.5919 3025.8123 3027.9618 3028.3721 3030.3083 3030.4968 3038.6890 3051.9941 3079.9551 3083.6845 3085.7429 3099.3663 3137.6857 3159.0333 3167.9852 3186.2342 3562.4658
redmass: 4.1346 5.1098 3.8525 4.6650 3.5543 2.8868 3.5638 4.5627 3.5636 4.1396 4.2017 5.7299 3.2796 2.1131 1.1164 1.7248 2.6650 1.4433 2.5202 4.2089 4.2980 3.6106 2.8593 3.1341 2.1674 3.1165 2.7543 2.0748 2.9884 3.0810 4.6540 3.5864 2.7303 3.7578 2.0218 2.9825 2.9323 2.3554 2.7582 6.7349 4.1595 3.8054 3.4360 3.6609 1.4744 2.7806 3.7944 1.4608 1.5969 1.4928 1.7406 2.2508 2.3355 2.1094 1.6516 1.8675 2.1411 1.5242 1.4069 2.3309 1.6996 1.9217 4.2541 2.6212 2.1543 1.8404 1.9032 1.4044 1.5649 3.5843 2.7086 2.0912 2.1398 2.3185 2.3371 1.4850 2.3252 2.5972 2.5784 2.2659 2.0588 2.4206 1.2215 1.2279 1.2011 1.3475 1.2881 1.4086 1.2693 1.3489 1.3009 1.2493 1.2547 1.3991 1.2731 1.2255 1.4087 1.3048 1.4356 1.2864 1.3626 1.2885 1.4983 1.5224 1.4362 2.5955 1.6304 1.4429 1.2509 3.0367 1.4405 1.0822 1.0797 1.0953 1.0921 1.0931 1.0890 1.0887 1.0663 1.0819 2.1682 1.1013 1.1181 1.0533 7.6550 6.2010 1.0707 1.0692 1.0685 1.0658 1.0690 1.0779 1.0667 1.0651 1.0656 1.0624 1.0756 1.0624 1.0358 1.0897 1.0926 1.0958 1.0911 1.0900 1.0937 1.1026 1.1018 1.0963 1.0978 1.0984 1.1003 1.0881 1.0902 1.0955 1.0949 1.0654
irintensity: 0.3715 0.1358 0.0817 0.3103 0.0633 0.0881 0.7151 0.6556 1.2169 0.8773 0.3718 0.1232 7.8177 0.0444 2.6841 1.8957 17.2352 108.6924 8.6667 1.3082 15.3287 4.8003 23.2961 1.9126 6.3433 2.5075 2.7429 1.3820 0.2352 0.5130 4.0468 4.0740 1.2743 28.0314 11.5123 9.3827 2.2848 4.5405 14.3487 0.9666 7.6222 6.3135 9.8780 5.5274 0.1175 14.6713 25.4706 36.2918 0.1088 13.3992 18.3490 26.6149 3.1244 6.0774 12.0282 8.2865 15.4280 2.6755 9.3835 18.2759 11.0186 16.6482 48.8242 30.5968 9.1263 18.5015 9.6699 6.8699 3.1051 9.3486 35.0110 21.5565 7.4612 19.5490 0.3478 5.7980 47.5392 35.6906 14.0167 10.8622 20.3313 4.6697 0.6845 1.8423 3.6364 28.4116 2.5943 0.4150 0.6143 5.4214 11.0263 9.2060 1.7996 18.0792 3.2107 0.8151 0.2316 0.8380 2.7358 8.6269 1.4278 10.1322 0.3735 5.6656 2.1422 2.5953 14.0349 1.8927 22.4774 12.6591 2.6182 2.5235 1.7585 22.3829 1.5130 9.3419 5.5982 9.3736 0.8125 18.8386 89.3059 1.5230 4.4934 11.0785 2.1362 8.6405 44.1627 59.3817 160.2987 25.7307 56.0234 15.1002 97.0527 23.7338 22.5234 48.9865 19.1478 14.9846 23.1773 13.4166 98.2150 108.1078 15.6100 20.9054 40.1385 60.6041 60.0423 38.3539 35.5871 37.0002 15.0557 13.1910 2.6249 4.5247 1.6806 3.8838
temp: 298.150 k
press: 1.00000 atm
elementType: 17 8 8 7 6 6 6 6 6 6 6 6 6 6 6 6 6 6 6 6 6 6 6 6 1 1 1 1 1 1 1 1 1 1 1 1 1 1 1 1 1 1 1 1 1 1 1 1 1 1 1 1 1 1
symmnumber: 1
zpe: 1216722.1 jmol-1
zpe.correction: 0.463425 hartree
zpe.thermalcorrener: 0.487527 hartree
zpe.thermalcorrenthalpy: 0.488471 hartree
zpe.thermalcorrgfe: 0.408614 hartree
zpe.sumelectzpe: -1443.487007 hartree
zpe.sumelectthermal: -1443.462904 hartree
zpe.sumelectthermalent: -1443.461960 hartree
zpe.sumelectthermalfe: -1443.541818 hartree
dipole: 1.8911 2.3951 0.0778
dipole: 3.0526
quadrupole: -180.6466 -152.1713 -148.6929
quadrupole: 1.3519 3.6950 2.3120
quadrupole: -20.1430 8.3323 11.8107 1.3519 3.6950 2.3120
hfenergy: -1443.9504315 hartree
pointgroup: C01 [X(C20H30Cl1N1O2)]
dipole: 0.5051021 1.0877876 0.0631972 debye
polarizability: 253.9860078|36.3871413|248.1046468|2.5168584|11.9731025|199.3678649 unknown
InChI: InChI=1S/C20H30ClNO2/c1-16(15-22-11-13-24-14-12-22)20(23,17-5-3-2-4-6-17)18-7-9-19(21)10-8-18/h7-10,16-17,23H,2-6,11-15H2,1H3
charge 0 multiplicity 1
54 atoms
Cl -4.588149 -4.057627 -0.996727
O  -1.292963 0.885447 2.18218
O  5.722601 -0.71642 -0.583219
N  2.87017 -0.768919 0.003729
C  -0.82819 1.706358 -0.118407
C  -0.781096 0.463235 0.849908
C  0.679489 -0.104034 1.081389
C  -2.266006 2.283992 -0.23235
C  0.164873 2.832799 0.280193
C  -2.331432 3.482574 -1.207664
C  0.094729 4.035306 -0.694123
C  -1.340188 4.597667 -0.804478
C  1.430349 -0.482128 -0.224244
C  -1.740674 -0.64338 0.382883
C  0.693381 -1.296141 2.063882
C  3.681689 0.457706 0.211903
C  3.45473 -1.585806 -1.093165
C  -1.726475 -1.108622 -0.957761
C  -2.648397 -1.242892 1.291177
C  5.144336 0.085475 0.506581
C  4.916676 -1.934508 -0.773085
C  -2.585921 -2.144609 -1.385418
C  -3.51755 -2.279117 0.882524
C  -3.470623 -2.717434 -0.453298
H  -0.530903 1.357521 -1.129943
H  1.239573 0.72588 1.564358
H  -2.603663 2.600318 0.774225
H  -2.964594 1.493915 -0.56422
H  1.203922 2.453456 0.306926
H  -0.075391 3.199472 1.302875
H  -3.364159 3.880522 -1.239474
H  -2.091482 3.137297 -2.235421
H  0.433105 3.705459 -1.698556
H  0.797365 4.824928 -0.363869
H  -1.370837 5.427607 -1.536715
H  -1.644841 5.020936 0.175199
H  1.310726 0.318346 -0.997603
H  0.972641 -1.402186 -0.634035
H  0.196597 -1.033837 3.013469
H  0.171032 -2.17159 1.637346
H  1.737843 -1.589187 2.265286
H  -0.677231 1.576681 2.534252
H  3.280553 1.027402 1.070818
H  3.646091 1.124436 -0.688765
H  3.418934 -1.04476 -2.073162
H  2.868429 -2.518523 -1.194982
H  -1.054065 -0.660085 -1.696854
H  -2.67444 -0.881194 2.321448
H  5.776538 0.986055 0.578023
H  5.195943 -0.484915 1.459273
H  4.957828 -2.557342 0.146508
H  5.390089 -2.474719 -1.609515
H  -2.568924 -2.492836 -2.422224
H  -4.215935 -2.73348 1.591623
