program: Gaussian 09
title: 000251752
version: EM64L-G09RevD.01
frameworkgroup: C1[X(C8H17Cl2N2O2P)]
method: RPBEPBE
basis: SDD
operation: Freq
keyword: #p
keyword: freq=noraman
keyword: PBEPBE/SDD
title: #p freq=noraman PBEPBE/SDD
converged: YES YES NO NO
title: Mulliken charges:
elementType: Cl Cl P O O N N C C C C C C C C H H H H H H H H H H H H H H H H H
charge: -0.063324 -0.066254 1.304328 -0.505006 -0.616190 -0.422001 -0.538246 -0.405629 -0.383665 -0.319922 -0.281511 -0.216014 -0.550876 -0.568585 -0.657584 0.273736 0.254411 0.254074 0.255709 0.278896 0.237108 0.273787 0.234607 0.231102 0.212929 0.261011 0.288239 0.301401 0.258868 0.232688 0.232391 0.209519
chargesum: 0.00000
title: Mulliken charges with hydrogens summed into heavy atoms:
elementType: Cl Cl P O O N N C C C C C C C C
charge: -0.063324 -0.066254 1.304328 -0.505006 -0.616190 -0.422001 -0.538246 0.122518 0.126118 0.196083 0.226884 0.228018 -0.001625 -0.008315 0.017013
polarizability: 1.64778557e+02 2.71057894e+00 1.54818124e+02 1.88782524e+00 1.19785731e+00 1.32116994e+02
1716.lowfreq: -11.0006 -8.2712 -0.0017 -0.0006 0.0022 0.6395 5.8222 30.1757 40.9124
frequency: -8.6074 30.1426 40.8684 43.6766 52.6836 56.8782 69.2922 81.0460 88.3246 116.6050 133.4796 158.0824 196.5738 208.4444 212.6120 219.7968 238.4017 248.0522 293.5589 306.6145 327.2827 361.4412 429.7190 464.1992 474.9862 544.3111 659.3569 671.9902 688.9896 730.1705 775.8720 777.2752 786.7239 813.1907 814.8285 879.6667 885.1380 962.4865 994.0039 999.5773 1017.9487 1023.0340 1040.2822 1050.9137 1063.2283 1075.8819 1104.6383 1115.0583 1116.5192 1122.3487 1134.6527 1156.5570 1208.3159 1233.9878 1235.7927 1252.0096 1253.7383 1257.5448 1291.4089 1335.0197 1351.7906 1357.7651 1364.0477 1394.2073 1447.6629 1448.0357 1450.9435 1458.4742 1461.3937 1463.1297 1473.0418 1478.2454 1488.8053 2975.9403 2995.0860 3011.4204 3018.8512 3040.3855 3061.8136 3062.8225 3076.6521 3083.1990 3083.7694 3086.3898 3092.0019 3109.5628 3150.0379 3157.3259 3186.1797 3203.1749
redmass: 4.8498 10.0760 5.2862 5.7355 3.9856 2.1103 3.2911 2.2226 2.2975 3.6574 4.3334 3.8826 3.9280 6.9610 4.7205 6.3901 1.2902 4.3846 3.2304 3.1179 4.4894 5.5663 5.4840 6.3312 5.1988 7.0322 7.8865 6.6651 5.5387 4.5346 1.1724 1.1835 7.9719 1.1160 1.0960 3.9828 4.1845 2.6005 1.0743 1.4311 6.3659 2.6231 2.7422 3.3343 2.1537 1.2751 2.1440 1.5445 1.3585 1.2962 1.4379 1.3775 2.5131 3.2481 1.6217 1.1635 1.1646 1.1500 1.1627 1.2466 1.2328 1.2441 1.2533 1.2424 1.0756 1.0845 1.0922 1.0404 1.0978 1.1580 1.0721 1.0503 1.0830 1.0553 1.0366 1.0626 1.0612 1.1084 1.0567 1.0576 1.0492 1.0635 1.0982 1.1036 1.0982 1.1020 1.1122 1.1117 1.1180 1.1180
irintensity: 0.1870 0.5266 1.0366 0.6745 0.4328 2.2561 0.9207 0.4159 3.2941 9.1774 6.7932 4.0575 7.6499 1.3730 0.5555 2.1772 1.8327 9.2821 1.1279 13.5135 26.4920 4.0154 23.3958 9.2964 36.4663 24.6583 56.2218 59.5321 110.6978 143.1904 9.4840 13.6416 4.3672 30.7248 3.1882 181.8931 155.6584 111.0936 3.2442 5.8494 68.1668 112.3356 3.8925 16.4638 23.3244 14.4937 6.4576 40.0683 21.2917 10.9640 4.1562 0.1796 70.5736 51.0961 10.5814 18.0094 1.1615 0.7530 8.3603 12.6304 0.5345 7.8980 0.9353 26.5407 7.9893 11.7922 1.9564 11.3809 25.9518 7.9202 8.3617 7.9261 7.1393 37.4047 22.4736 14.7448 13.4037 16.7779 6.5578 23.8029 13.8743 19.9043 2.8253 2.7073 29.9550 31.7260 9.9072 9.1329 0.9677 8.9806
temp: 298.150 k
press: 1.00000 atm
elementType: 17 17 15 8 8 7 7 6 6 6 6 6 6 6 6 1 1 1 1 1 1 1 1 1 1 1 1 1 1 1 1 1
symmnumber: 1
zpe: 663672.5 jmol-1
zpe.correction: 0.252780 hartree
zpe.thermalcorrener: 0.271516 hartree
zpe.thermalcorrenthalpy: 0.272461 hartree
zpe.thermalcorrgfe: 0.202778 hartree
zpe.sumelectzpe: -1835.060928 hartree
zpe.sumelectthermal: -1835.042191 hartree
zpe.sumelectthermalent: -1835.041247 hartree
zpe.sumelectthermalfe: -1835.110929 hartree
dipole: 4.3985 0.2469 -0.0416
dipole: 4.4056
quadrupole: -108.2986 -127.4149 -111.3890
quadrupole: -6.0016 -1.1746 -14.4541
quadrupole: 7.4022 -11.7140 4.3118 -6.0016 -1.1746 -14.4541
hfenergy: -1835.3137075 hartree
pointgroup: C01 [X(C8H17Cl2N2O2P1)]
dipole: -1.5337315 -0.3841713 -0.7102255 debye
polarizability: 160.1180465|6.6946313|135.3863424|3.8261766|7.506978|156.2092854 unknown
InChI: InChI=1S/C8H17Cl2N2O2P/c1-2-14-15(13,12-7-8-12)11(5-3-9)6-4-10/h2-8H2,1H3
charge 0 multiplicity 1
32 atoms
Cl 3.224477 1.544686 3.121215
Cl 2.960042 -1.396904 -3.317881
P  -0.772092 0.36155 0.012394
O  -1.114689 -1.23472 0.611693
O  -1.337629 1.570928 0.895887
N  -1.323773 0.260943 -1.69166
N  0.946775 0.323047 -0.127003
C  -1.752178 1.563901 -2.35223
C  -2.793108 0.529461 -1.976164
C  1.756105 1.185732 0.761979
C  1.623576 -0.701796 -0.954469
C  -2.51179 -1.579846 1.00416
C  2.032156 0.48567 2.104105
C  1.970692 -0.118696 -2.332836
C  -2.422346 -2.824943 1.882611
H  -1.714885 2.477458 -1.746094
H  -1.428662 1.660549 -3.392548
H  -3.222466 -0.121648 -2.742946
H  -3.449867 0.77644 -1.132498
H  1.221358 2.133577 0.945124
H  2.708904 1.422368 0.25459
H  0.972514 -1.584185 -1.074078
H  2.543263 -1.037409 -0.440224
H  -2.956466 -0.7255 1.550792
H  -3.099665 -1.777094 0.086498
H  2.528499 -0.488498 1.980794
H  1.12121 0.388067 2.712049
H  1.062946 0.08459 -2.917146
H  2.615649 0.770194 -2.265776
H  -1.832931 -2.617172 2.791388
H  -1.941075 -3.652695 1.334495
H  -3.435645 -3.147657 2.185881
