program: Gaussian 09
title: 000251746
version: EM64L-G09RevD.01
frameworkgroup: C1[X(C11H15NO2S2)]
method: RPBEPBE
basis: SDD
operation: Freq
keyword: #p
keyword: freq=noraman
keyword: PBEPBE/SDD
title: #p freq=noraman PBEPBE/SDD
converged: YES YES NO NO
title: Mulliken charges:
elementType: S S O O N C C C C C C C C C C C H H H H H H H H H H H H H H H
charge: 0.499544 0.867520 -0.565516 -0.572830 -0.546662 -0.390992 -0.363285 -0.640682 -0.652604 -0.017232 -0.245698 -0.237237 0.452497 -0.364798 -0.365371 -0.801473 0.281387 0.237156 0.210561 0.251309 0.332258 0.272877 0.275138 0.348761 0.280000 0.277972 0.239551 0.239533 0.228429 0.241381 0.228505
chargesum: 0.00000
title: Mulliken charges with hydrogens summed into heavy atoms:
elementType: S S O O N C C C C C C C C C C C
charge: 0.499544 0.867520 -0.565516 -0.572830 -0.546662 0.127551 0.098585 -0.035548 -0.028706 -0.017232 0.034302 0.040735 0.452497 -0.125247 -0.125838 -0.103158
polarizability: 2.81536087e+02 5.38313878e-01 1.59920322e+02 6.35117346e+00 1.79900335e+00 1.17291611e+02
1716.lowfreq: -15.4863 -5.0528 -0.0025 -0.0018 -0.0018 8.5250 18.0683 20.6998 31.4062
frequency: 16.5727 20.6135 31.3095 43.0204 78.7480 89.9715 129.4762 150.0252 165.2550 167.6756 222.6347 256.1981 260.0849 285.8433 307.3144 338.9373 368.1926 388.7860 407.6611 414.3327 453.4995 467.0083 495.1647 535.9819 543.5702 560.9610 596.1212 621.9004 622.6558 710.2870 769.5460 787.0884 801.3343 828.1815 849.5152 871.1760 876.8915 881.6938 898.4423 961.4408 979.9725 980.5627 989.3351 997.2409 1015.9985 1049.3568 1058.1691 1075.3276 1089.2653 1116.3913 1124.9873 1182.6014 1198.9238 1213.1271 1217.8468 1258.8957 1279.2777 1295.1218 1318.7474 1335.8872 1381.6449 1391.7211 1398.1676 1413.7074 1437.0403 1457.1145 1465.8198 1471.0934 1473.9101 1474.5420 1596.0232 1597.8083 2979.1243 2996.1419 3009.3051 3024.4124 3036.8575 3060.5944 3061.6007 3080.9678 3090.4106 3132.8752 3132.8994 3134.5971 3140.0955 3161.9997 3165.3583
redmass: 4.5210 1.0323 4.3144 5.1804 3.3083 4.7719 5.0728 5.7753 4.1390 4.3265 8.4811 2.1005 4.6122 3.7445 4.9311 4.5474 10.7723 4.8487 2.8612 7.1422 4.0566 5.8777 5.0037 4.5569 4.4166 2.7337 6.1432 11.8982 6.9751 3.2779 8.2019 6.2515 1.3584 1.3817 1.2519 1.9334 2.6010 7.6456 1.5002 1.3123 1.5201 1.8809 1.3923 5.1932 1.3332 1.5901 2.5236 1.6031 1.1402 1.2807 1.4478 1.1432 1.4055 1.3592 2.9867 1.2297 1.2124 1.2650 1.3372 1.2603 5.9982 3.0499 1.2223 1.0960 1.0893 1.0845 1.0935 1.1036 1.1085 2.1505 6.9107 6.1347 1.0388 1.0608 1.0611 1.0609 1.0595 1.1007 1.0949 1.1026 1.1000 1.0897 1.1087 1.0894 1.1100 1.0952 1.0964
irintensity: 3.7614 1.0701 0.8590 3.8016 0.9016 0.0676 4.7499 1.8154 4.7056 0.9748 23.0202 1.6054 4.2902 1.8668 3.3046 14.2345 6.3661 2.9932 0.0163 4.7816 8.7693 76.6844 27.0206 54.9493 28.2299 5.9307 34.6227 99.7142 0.4006 0.5630 44.5704 32.7096 16.2502 35.7705 1.4784 16.0959 9.3247 70.7634 14.7786 0.6581 2.1147 6.9247 1.0849 3.5407 0.7385 24.2412 30.9293 0.4587 0.5110 8.2963 8.5768 15.3644 3.8606 3.8285 6.8277 7.2457 4.7008 2.1637 8.2655 0.5505 0.1168 9.7492 14.1239 17.0517 12.1187 10.1543 12.1776 15.7991 14.6752 21.4289 0.7340 10.3128 30.9643 36.1963 24.4436 27.0719 20.6481 7.0374 20.3228 17.7230 15.9249 17.6410 2.1350 11.6641 1.0882 2.6095 10.0946
temp: 298.150 k
press: 1.00000 atm
elementType: 16 16 8 8 7 6 6 6 6 6 6 6 6 6 6 6 1 1 1 1 1 1 1 1 1 1 1 1 1 1 1
symmnumber: 1
zpe: 626950.7 jmol-1
zpe.correction: 0.238793 hartree
zpe.thermalcorrener: 0.256279 hartree
zpe.thermalcorrenthalpy: 0.257223 hartree
zpe.thermalcorrgfe: 0.190638 hartree
zpe.sumelectzpe: -1428.046676 hartree
zpe.sumelectthermal: -1428.029190 hartree
zpe.sumelectthermalent: -1428.028246 hartree
zpe.sumelectthermalfe: -1428.094831 hartree
dipole: -1.4023 -0.3379 1.8134
dipole: 2.3171
quadrupole: -65.9374 -106.9226 -121.8935
quadrupole: 0.0593 -1.3260 0.7761
quadrupole: 32.3138 -8.6714 -23.6424 0.0593 -1.3260 0.7761
hfenergy: -1428.2854688 hartree
pointgroup: C01 [X(C11H15N1O2S2)]
dipole: 0.5738059 0.0174975 0.7081691 debye
polarizability: 281.0227077|0.6222774|159.4490823|-11.1541588|4.7688084|118.2762293 unknown
InChI: InChI=1S/C11H15NO2S2/c1-10-4-6-11(7-5-10)16(13,14)12-15-8-2-3-9-15/h4-7H,2-3,8-9H2,1H3
charge 0 multiplicity 1
31 atoms
S  2.85676 -0.77394 1.420596
S  0.465658 -0.513268 -0.435464
O  0.80001 -1.833566 -1.361365
O  0.89194 0.954266 -1.057903
N  1.066051 -0.738087 1.332981
C  4.140107 -1.016653 -1.060866
C  4.696141 0.274662 -0.403894
C  3.635512 -1.947108 0.048962
C  3.634678 0.814691 0.563337
C  -1.379029 -0.489735 -0.088391
C  -2.002139 0.752025 0.109309
C  -2.070075 -1.711273 -0.067647
C  -4.141168 -0.447162 0.379693
C  -3.394714 0.760671 0.343443
C  -3.461607 -1.676759 0.17048
C  -5.642458 -0.421903 0.603504
H  3.303369 -0.774893 -1.73997
H  4.924755 -1.524004 -1.651737
H  5.640081 0.055497 0.131307
H  4.914943 1.037593 -1.172915
H  2.812468 -2.607857 -0.260272
H  4.435124 -2.48605 0.583193
H  4.023375 1.426712 1.390623
H  2.781777 1.291585 0.05175
H  -1.416417 1.675544 0.061465
H  -1.537962 -2.65031 -0.249015
H  -3.907078 1.716788 0.501384
H  -4.025759 -2.616312 0.194836
H  -5.945638 0.438702 1.224776
H  -6.182262 -0.338689 -0.359774
H  -5.994646 -1.343865 1.097973
