program: Gaussian 09
title: 000251744
version: EM64L-G09RevD.01
frameworkgroup: C1[X(C9H13NO)]
method: RPBEPBE
basis: SDD
operation: Freq
keyword: #p
keyword: freq=noraman
keyword: PBEPBE/SDD
title: #p freq=noraman PBEPBE/SDD
converged: YES YES NO NO
title: Mulliken charges:
elementType: O N C C C C C C C C C H H H H H H H H H H H H H
charge: -0.298415 -0.215804 0.417328 -0.362460 -0.367985 -0.423628 -0.362982 -0.218683 -0.217972 -0.241175 -0.665251 0.204069 0.219983 0.255556 0.229402 0.225420 0.213088 0.269342 0.224140 0.224756 0.226750 0.200611 0.252134 0.211776
chargesum: 0.00000
title: Mulliken charges with hydrogens summed into heavy atoms:
elementType: O N C C C C C C C C C
charge: -0.298415 0.053538 0.417328 0.061592 -0.112429 -0.194225 0.075526 0.005458 0.006784 -0.014425 -0.000730
polarizability: 1.45348258e+02 -4.84100327e+00 1.03077212e+02 -1.20891602e+01 -9.99762620e+00 7.19475957e+01
1716.lowfreq: -18.7422 -8.1319 -2.3524 -0.0010 -0.0009 -0.0005 12.4659 33.8553 61.7667
frequency: -5.8405 33.7525 61.7173 75.6365 141.2379 209.6302 233.0401 264.9622 352.8644 360.4255 401.3275 455.9164 499.7611 582.1615 615.9351 700.3455 737.4529 749.2519 774.4931 824.3466 855.0065 878.3441 908.6250 922.5559 976.9039 989.2688 993.0289 993.3792 1008.1772 1026.3694 1043.4598 1084.5075 1095.3926 1170.8153 1171.4502 1175.6954 1185.3914 1216.5221 1271.5231 1310.2687 1330.5545 1346.5850 1380.6897 1385.8653 1403.5104 1438.4916 1443.4662 1468.7554 1475.5393 1484.0782 1484.8302 1593.8043 1616.6411 2958.1726 2977.6088 2989.6780 3010.8709 3053.0520 3075.5346 3099.2538 3115.7656 3125.5995 3139.1656 3154.8039 3166.5208 3314.1553
redmass: 3.2568 3.5828 3.6663 2.5234 3.1619 1.5020 1.9356 3.5632 3.2979 3.0915 2.8257 2.7498 2.7319 5.0654 6.3710 2.2427 1.5930 3.2619 1.2483 4.0044 1.2497 3.0265 1.3712 1.8284 1.3881 5.1747 1.6441 1.7723 1.8333 2.1608 3.4066 1.5703 1.8622 1.2743 1.2826 1.1526 1.1110 2.4286 1.1548 1.3911 1.2836 1.4426 1.2578 5.1487 1.1036 2.1188 1.1031 1.0440 1.1590 1.0645 2.0178 6.1650 6.1057 1.0567 1.0372 1.0629 1.1055 1.0981 1.0995 1.1000 1.0863 1.0871 1.0928 1.0962 1.0998 1.0750
irintensity: 0.3450 0.3100 6.2823 1.1726 2.5471 4.0685 0.4452 0.2088 8.5787 2.9956 0.7237 12.4419 0.6988 10.5200 0.6012 31.7436 43.8888 63.4577 23.2078 18.5592 0.1220 3.2949 15.9696 59.8092 0.1557 0.2048 18.0148 14.7778 6.4196 7.4712 9.1860 4.7923 11.4641 2.3131 7.3858 7.8585 0.5373 1.4632 9.8507 5.7518 8.7055 10.0799 23.3799 2.5832 1.0956 11.9790 4.4823 8.2019 22.5557 11.6175 5.4811 1.0450 3.9180 39.1448 31.8645 37.1957 33.7860 6.0608 54.8979 31.9917 7.1042 1.0018 31.6851 34.8837 12.7550 3.5304
temp: 298.150 k
press: 1.00000 atm
elementType: 8 7 6 6 6 6 6 6 6 6 6 1 1 1 1 1 1 1 1 1 1 1 1 1
symmnumber: 1
zpe: 528653.3 jmol-1
zpe.correction: 0.201353 hartree
zpe.thermalcorrener: 0.211839 hartree
zpe.thermalcorrenthalpy: 0.212784 hartree
zpe.thermalcorrgfe: 0.164003 hartree
zpe.sumelectzpe: -479.826630 hartree
zpe.sumelectthermal: -479.816144 hartree
zpe.sumelectthermalent: -479.815200 hartree
zpe.sumelectthermalfe: -479.863981 hartree
dipole: 0.8885 -0.0373 0.0470
dipole: 0.8905
quadrupole: -55.7778 -63.2395 -67.0478
quadrupole: 1.2618 -1.9359 -3.9703
quadrupole: 6.2439 -1.2178 -5.0261 1.2618 -1.9359 -3.9703
hfenergy: -480.0279834 hartree
pointgroup: C01 [X(C9H13N1O1)]
dipole: 0.3417556 0.0208712 0.0743068 debye
dipolederiv: -0.8041392 -0.1204991 -0.0248314 -0.0668459 -0.330533 -0.0375296 -0.1572043 -0.014378 -0.3400465 0.0766192 -0.0966316 0.0272025 -0.1799715 -0.3313195 0.1590143 0.1629202 0.1685359 -0.0577034 0.0876521 -0.0770445 0.070876 -0.1856059 0.0095635 -0.0563494 0.1551215 -0.0110417 0.0056569 0.7624216 0.0816045 -0.0068965 0.2817621 0.3484166 0.0803049 -0.2559525 -0.0175734 0.3023744 -0.0218138 -0.0375307 -0.0794472 0.0484019 -0.1577063 0.0342483 -0.1150687 0.0379784 -0.061909 -0.1549261 -0.0097211 -0.0260287 -0.0326009 -0.1626782 -0.0157831 -0.0489737 -0.0197126 0.0778355 0.2239914 0.089758 -0.0120947 0.2218074 0.3381663 -0.0485065 0.0553672 -0.0258456 0.245529 -0.0517774 -0.0307029 0.0084457 -0.0427576 -0.1426972 -0.0263699 0.0240297 -0.0207588 0.142031 0.041552 -0.0614946 -0.0736805 -0.0445306 -0.1330158 0.0178141 -0.0880678 0.0224554 0.0105852 0.0209494 -0.0637464 0.0559896 -0.0589548 -0.1532538 -0.0206851 0.0636303 -0.0252358 -0.0485841 -0.0061779 -0.0792332 0.0000731 -0.1387677 -0.0861938 0.0962732 -0.0021883 0.1336214 -0.0597826 -0.0174933 -0.0142752 0.0076168 -0.0349021 0.0340588 -0.0866584 0.0399411 -0.0343862 -0.1536153 -0.0865162 0.0433554 -0.0355955 -0.0329643 -0.1642325 0.0415851 0.0561729 0.0001188 0.064232 0.0246786 0.0475497 0.092803 0.0502137 0.1371968 -0.0109505 0.111248 -0.0179665 0.0531862 0.0925231 0.0195554 -0.0403407 0.0149802 0.145682 0.0156322 -0.016917 0.0155181 -0.1216865 0.0365133 0.0410136 0.1255279 -0.0044633 -0.0090797 -0.0638724 0.0940779 -0.0515673 -0.052712 -0.1414803 0.0459802 -0.1143198 0.0113852 -0.000039 0.0598724 -0.0861376 0.062563 0.0275882 -0.0024866 0.0550349 0.0420477 0.0130332 0.2382618 -0.0458111 0.0100586 -0.1606288 -0.0007814 0.0772887 0.0202642 -0.0137221 0.0199548 0.1493857 0.0194451 -0.0336171 0.0197911 -0.1364996 -0.0662279 0.0561428 0.0937269 0.0638481 0.1422868 -0.0217309 0.1046601 -0.0254365 0.0138426 -0.0838739 0.0725067 -0.0827552 0.0777781 0.1395553 0.0316576 -0.0846532 0.0292784 0.04639 0.0055618 0.0580433 0.1090485 0.1069965 0.0013928 -0.0952141 0.1118271 -0.04879 -0.0413305 -0.0110078 0.09121 -0.0940477 0.0828088 0.0858669 0.0274248 -0.0636259 0.0489887 0.0330179 -0.0018308 -0.1311395 -0.0295979 -0.1706057 -0.0990845 -0.0538112 -0.0366483 -0.0655282 0.052382 unknown
polarizability: 144.69764|-10.8522416|68.5158138|6.8896445|-3.2459678|107.1596115 unknown
InChI: InChI=1S/C9H13NO/c1-2-10-11-8-9-6-4-3-5-7-9/h3-7,10H,2,8H2,1H3
charge 0 multiplicity 1
24 atoms
O  1.543165 -0.381444 -0.092293
N  2.817136 -0.899533 0.533168
C  -0.875285 -0.426906 0.059751
C  0.412712 -0.888771 0.715503
C  -0.980219 -0.327371 -1.350835
C  -2.006186 -0.12147 0.857277
C  3.63933 0.286472 0.919673
C  -2.198576 0.062409 -1.950461
C  -3.228335 0.258772 0.257534
C  -3.328309 0.35228 -1.149815
C  4.029825 1.234009 -0.234725
H  0.489301 -0.510357 1.754304
H  0.474871 -1.99577 0.752491
H  -0.100555 -0.543038 -1.965428
H  -1.932513 -0.180146 1.950583
H  3.07157 0.831095 1.694543
H  4.5418 -0.132165 1.409871
H  3.270619 -1.385731 -0.266385
H  -2.267214 0.140851 -3.041639
H  -4.095962 0.489063 0.886315
H  -4.273412 0.652366 -1.616378
H  4.672193 0.719012 -0.974644
H  3.122831 1.592768 -0.750453
H  4.587115 2.109607 0.146544
