program: Gaussian 09
title: 000251748
version: EM64L-G09RevD.01
frameworkgroup: C1[X(C8H16Cl3N2O2P)]
method: RPBEPBE
basis: SDD
operation: Freq
keyword: #p
keyword: freq=noraman
keyword: PBEPBE/SDD
title: #p freq=noraman PBEPBE/SDD
converged: NO YES NO NO
title: Mulliken charges:
elementType: Cl Cl Cl P O O N N C C C C C C C C H H H H H H H H H H H H H H H H
charge: -0.058145 -0.054194 -0.058364 1.336769 -0.481079 -0.597085 -0.478552 -0.539836 -0.411690 -0.367602 -0.265189 -0.316753 -0.184447 -0.578852 -0.561000 -0.567328 0.253513 0.275732 0.259067 0.273672 0.249971 0.238987 0.290068 0.234617 0.216536 0.247399 0.289946 0.266006 0.291381 0.253830 0.255333 0.287287
chargesum: 0.00000
title: Mulliken charges with hydrogens summed into heavy atoms:
elementType: Cl Cl Cl P O O N N C C C C C C C C
charge: -0.058145 -0.054194 -0.058364 1.336769 -0.481079 -0.597085 -0.478552 -0.539836 0.117555 0.165137 0.223769 0.207932 0.279488 -0.022900 -0.015789 -0.024707
polarizability: 1.77297480e+02 -1.11471035e+01 1.56792087e+02 -6.13643268e+00 -1.21035745e+00 1.37715454e+02
1716.lowfreq: -10.5944 -6.4308 -2.3883 -0.0021 -0.0020 0.0022 11.5184 23.2441 28.1359
frequency: 9.9518 23.0776 28.1033 31.0450 40.9029 46.3610 56.4124 78.2263 88.1332 97.7108 108.4232 127.5829 172.6638 199.2888 204.8322 211.5460 216.5895 234.6314 266.5332 307.3236 323.1511 352.5434 371.4879 428.2003 461.5139 477.3882 543.7447 603.5202 644.7235 667.4238 690.3159 716.6917 770.3594 778.6425 794.9129 807.9521 859.1186 889.4059 947.5526 955.2041 987.3544 998.9315 1001.3134 1034.1936 1041.3706 1051.4817 1063.3702 1080.5993 1086.3815 1115.0373 1118.8417 1126.9185 1153.1056 1167.4142 1203.8986 1221.0159 1233.5540 1243.4522 1253.9165 1255.6324 1292.2327 1298.3953 1330.7219 1351.8109 1357.8193 1367.2452 1427.8316 1443.7893 1451.6833 1453.7521 1457.8907 1458.8313 1468.8558 1469.3469 2956.8644 3002.6156 3018.5091 3039.4163 3052.9952 3061.8423 3066.1608 3080.9312 3083.7381 3090.0939 3094.4901 3141.4968 3147.8191 3157.3573 3191.4552 3211.0085
redmass: 9.1706 12.2228 6.9617 7.1436 5.2408 3.6867 6.9149 2.4214 2.3582 5.6730 3.4015 4.4629 4.8235 3.5979 4.6655 5.3975 6.4050 6.4367 2.8419 3.9128 3.9343 5.0948 3.5637 5.0174 6.3430 5.2996 5.9864 5.3519 6.0441 7.3926 5.3960 4.3858 1.1824 1.1787 8.1451 1.0982 2.4217 4.8008 2.2111 2.5660 2.0294 1.4016 1.0885 3.2034 3.7850 4.9625 2.0423 2.0676 1.4551 1.5961 1.3384 1.2872 1.3967 1.1634 2.3390 1.1553 1.6094 3.2110 1.1768 1.1593 1.1567 1.1892 1.2191 1.2281 1.2605 1.2584 1.1014 1.0797 1.0913 1.0772 1.0874 1.0816 1.1418 1.0966 1.0604 1.0648 1.0606 1.0991 1.0566 1.0601 1.0575 1.0518 1.1043 1.0980 1.0583 1.1122 1.1097 1.1119 1.1188 1.1181
irintensity: 0.3665 1.7614 0.7157 0.4682 1.8428 4.6036 1.8484 1.5688 1.8692 2.0281 1.1412 9.3194 1.2627 0.5900 7.6642 2.3124 0.3305 20.3465 3.7265 19.8009 17.4129 5.6407 10.4778 26.9963 13.2220 17.5332 21.4651 30.5947 67.2480 18.7400 110.7438 175.9468 5.9671 15.3900 6.8264 20.1488 76.6887 184.3762 112.9817 66.1998 53.2622 3.1358 0.6788 45.5990 19.8366 38.0294 36.3079 12.7349 19.3382 52.6925 5.6234 11.6196 0.4083 2.9306 68.6812 1.7539 12.6574 59.5835 20.7911 2.8769 6.0195 18.2588 12.5471 2.3293 1.4878 0.4306 12.6150 8.9166 0.3478 9.5220 26.2182 9.0873 4.4181 15.7468 37.8692 18.8183 13.1395 8.5376 18.4967 22.5196 14.4823 13.1903 1.5018 7.5649 11.8788 9.4486 6.5552 11.9836 2.3161 6.0474
temp: 298.150 k
press: 1.00000 atm
elementType: 17 17 17 15 8 8 7 7 6 6 6 6 6 6 6 6 1 1 1 1 1 1 1 1 1 1 1 1 1 1 1 1
symmnumber: 1
zpe: 640588.1 jmol-1
zpe.correction: 0.243987 hartree
zpe.thermalcorrener: 0.264598 hartree
zpe.thermalcorrenthalpy: 0.265542 hartree
zpe.thermalcorrgfe: 0.188268 hartree
zpe.sumelectzpe: -2294.444304 hartree
zpe.sumelectthermal: -2294.423693 hartree
zpe.sumelectthermalent: -2294.422749 hartree
zpe.sumelectthermalfe: -2294.500022 hartree
dipole: -1.3002 2.5021 -2.2104
dipole: 3.5829
quadrupole: -138.3065 -138.7468 -121.4334
quadrupole: -0.3014 2.9593 17.2081
quadrupole: -5.4776 -5.9179 11.3955 -0.3014 2.9593 17.2081
hfenergy: -2294.6882907 hartree
pointgroup: C01 [X(C8H16Cl3N2O2P1)]
dipole: -0.0681098 -0.7255227 -1.2066399 debye
polarizability: 153.8138336|-12.8587862|176.6587242|5.2609597|6.4242151|141.3324634 unknown
InChI: InChI=1S/C8H16Cl3N2O2P/c9-1-4-12(5-2-10)16(14,13-6-7-13)15-8-3-11/h1-8H2
charge 0 multiplicity 1
32 atoms
Cl -3.698455 -0.486819 -2.687069
Cl -1.01739 4.831491 1.053586
Cl 3.975445 -2.145499 -0.945671
P  0.284741 -0.188762 0.901421
O  1.845341 0.097253 0.160109
O  0.392143 0.084205 2.466484
N  -0.091364 -1.81067 0.271854
N  -0.934928 0.784616 0.128814
C  -0.744136 -2.813823 1.210276
C  0.706683 -2.985648 0.805838
C  -1.53647 0.458843 -1.183324
C  -1.316999 2.057508 0.786706
C  2.062135 -0.098949 -1.28608
C  -2.897616 -0.229541 -0.992912
C  -0.392417 3.200571 0.333535
C  3.538169 -0.393189 -1.491642
H  -1.517807 -3.427738 0.740324
H  -0.944105 -2.486796 2.238102
H  0.983566 -3.714671 0.039891
H  1.474518 -2.78158 1.560797
H  -0.877108 -0.215174 -1.753564
H  -1.665776 1.387457 -1.771498
H  -1.254212 1.937696 1.882187
H  -2.36485 2.294196 0.5283
H  1.811056 0.844053 -1.816878
H  1.43536 -0.920046 -1.68267
H  -2.786408 -1.230089 -0.553163
H  -3.607356 0.381939 -0.416272
H  0.63299 3.07454 0.71133
H  -0.395872 3.338164 -0.758836
H  3.812124 -0.338699 -2.556768
H  4.166797 0.274865 -0.885707
