program: Gaussian 09
title: 000251736
version: EM64L-G09RevD.01
frameworkgroup: C1[X(C4H4BrClN4)]
method: RPBEPBE
basis: SDD
operation: Freq
keyword: #p
keyword: freq=noraman
keyword: PBEPBE/SDD
title: #p freq=noraman PBEPBE/SDD
converged: NO NO NO NO
title: Mulliken charges:
elementType: Br Cl N N N N C C C C H H H H
charge: 0.030536 0.009614 -0.113919 -0.016548 -0.623915 -0.588201 0.338218 -0.237543 0.002014 -0.138166 0.335666 0.328990 0.339278 0.333976
chargesum: 0.00000
title: Mulliken charges with hydrogens summed into heavy atoms:
elementType: Br Cl N N N N C C C C
charge: 0.030536 0.009614 -0.113919 -0.016548 0.040741 0.085053 0.338218 -0.237543 0.002014 -0.138166
polarizability: 1.49189205e+02 5.33341154e-01 1.12643417e+02 -1.97260313e-04 8.03585615e-04 3.62016840e+01
1716.lowfreq: -9.8965 -4.6731 -3.7598 -0.0013 0.0007 0.0018 63.8096 154.4653 165.8647
frequency: 63.8035 154.4647 165.8644 211.1934 222.3884 281.0792 289.0030 321.6739 396.0012 472.7959 489.1527 519.2159 520.9736 539.2644 554.1194 597.8155 626.8824 692.3971 763.2501 845.3571 916.3891 996.4184 1043.0471 1137.9616 1297.0443 1326.6321 1428.1364 1467.9756 1522.2465 1549.4478 1604.8362 1623.2057 3539.2779 3563.1013 3692.3545 3720.9818
redmass: 7.1375 28.9856 7.5107 6.6844 8.2017 8.1523 5.1638 4.2295 10.0953 1.2050 1.1739 3.1522 1.0700 1.0972 8.1248 8.0815 7.9382 10.4355 12.2928 6.3520 8.1933 2.0648 3.0119 2.3477 6.5260 6.7085 5.9055 4.2769 2.8081 4.2940 1.5021 1.7285 1.0447 1.0443 1.1052 1.1061
irintensity: 0.0423 0.0049 7.6024 7.7562 1.4419 0.0085 5.1560 10.5579 6.0539 180.3928 332.7155 2.9553 3.1099 90.8570 6.7535 14.4682 7.2970 1.0341 37.6889 60.8596 36.0609 10.2107 49.3805 0.0082 116.6283 8.6106 117.5843 99.6081 210.8064 304.4251 670.9255 323.0233 92.9201 134.9383 52.5844 53.7075
temp: 298.150 k
press: 1.00000 atm
elementType: 35 17 7 7 7 7 6 6 6 6 1 1 1 1
symmnumber: 1
zpe: 234203.4 jmol-1
zpe.correction: 0.089203 hartree
zpe.thermalcorrener: 0.098797 hartree
zpe.thermalcorrenthalpy: 0.099741 hartree
zpe.thermalcorrgfe: 0.053195 hartree
zpe.sumelectzpe: -846.642055 hartree
zpe.sumelectthermal: -846.632461 hartree
zpe.sumelectthermalent: -846.631517 hartree
zpe.sumelectthermalfe: -846.678063 hartree
dipole: 1.9166 -3.8363 0.0001
dipole: 4.2884
quadrupole: -57.4642 -68.1560 -76.9641
quadrupole: 1.7822 -0.0009 -0.0001
quadrupole: 10.0639 -0.6279 -9.4360 1.7822 -0.0009 -0.0001
hfenergy: -846.7312579 hartree
pointgroup: C01 [X(C4H4Br1Cl1N4)]
dipole: 0.7443174 1.5139693 0.0232419 debye
dipolederiv: -0.6746845 0.0352786 0.0103863 0.0715296 -0.0559867 -0.0026323 0.0112962 -0.0021034 0.0175125 -0.2717723 -0.3263585 -0.0044712 -0.3566856 -0.6984161 -0.0089093 -0.0051717 -0.0093046 -0.0730553 -1.1237781 0.30252 0.0184766 0.3400229 -0.7540853 -0.0154407 0.0193419 -0.0148902 -0.2713175 -1.5953412 -0.1557215 0.0160613 -0.3732536 -0.6634684 -0.0053325 0.0110988 -0.0083544 -0.1915538 -0.3661496 0.4124296 0.0046249 0.3812925 -1.329884 -0.0193469 0.0039205 -0.019801 -0.6957765 -1.7329111 0.1031356 0.0161236 0.0466302 -0.190706 0.0115593 0.0148852 0.0107506 -0.732634 0.6639875 -0.2306394 -0.0109419 -0.2559351 1.6754014 0.0353977 -0.0115164 0.034995 0.2400791 0.7213851 -0.3209641 -0.0193479 0.0423931 -1.0565642 -0.0204928 -0.0113879 -0.0154775 -0.1601116 2.3305565 -0.1280119 -0.031898 0.069105 0.71803 0.0098665 -0.0274821 0.0126477 0.22991 1.1301646 0.3599292 -0.0066908 0.0799885 1.4432389 0.0291598 -0.0127982 0.0252434 0.0797577 0.1535643 0.0090605 0.0033929 -0.0170999 0.2791127 -0.0021278 0.0028176 -0.0024766 0.3853952 0.2045875 -0.0438135 0.0014218 -0.0143151 0.2804163 -0.0019765 0.0020595 -0.0015508 0.3779096 0.283425 -0.0320514 0.000851 -0.0843074 0.1876564 -0.0035551 -0.0002831 -0.0042719 0.3972184 0.2769662 0.0152068 0.0020115 0.0706349 0.1652551 -0.0061696 0.0032197 -0.0054064 0.396666 unknown
polarizability: 149.1728266|-0.2648302|112.6002352|-1.5720947|1.7004075|36.2612436 unknown
InChI: InChI=1S/C4H4BrClN4/c5-1-2(6)9-4(8)10-3(1)7/h7-8H2
charge 0 multiplicity 1
14 atoms
Br -3.008558 0.181469 0.071925
Cl -1.252448 -2.736143 -0.01719
N  1.099057 1.199814 0.03761
N  0.982228 -1.239065 -0.015089
N  -0.830849 2.509321 0.093317
N  3.035409 -0.117129 -0.018466
C  -0.267599 1.259712 0.057834
C  -1.061047 0.060498 0.042221
C  1.664479 -0.043751 0.002138
C  -0.358354 -1.156672 0.005352
H  -0.207503 3.313913 0.102564
H  -1.840874 2.63013 0.109878
H  3.479833 -1.030741 -0.045187
H  3.580927 0.739944 -0.006707
