program: Gaussian 09
title: 000251739
version: EM64L-G09RevD.01
frameworkgroup: C1[X(C10H8BrCl2N5)]
method: RPBEPBE
basis: SDD
operation: Freq
keyword: #p
keyword: freq=noraman
keyword: PBEPBE/SDD
title: #p freq=noraman PBEPBE/SDD
converged: YES YES NO NO
title: Mulliken charges:
elementType: Br Cl Cl N N N N N C C C C C C C C C C H H H H H H H H
charge: -0.020714 -0.027726 -0.017529 -0.472239 -0.173446 -0.130777 -0.636806 -0.590977 0.480719 0.434748 -0.266653 -0.477914 -0.542207 0.352160 -0.060098 -0.178071 -0.144170 0.008470 0.307827 0.340307 0.231879 0.256180 0.333958 0.330069 0.332152 0.330856
chargesum: 0.00000
title: Mulliken charges with hydrogens summed into heavy atoms:
elementType: Br Cl Cl N N N N N C C C C C C C C C C
charge: -0.020714 -0.027726 -0.017529 -0.164412 -0.173446 -0.130777 0.027221 0.072032 0.480719 0.434748 0.073654 -0.246035 -0.542207 0.352160 -0.060098 0.078109 -0.144170 0.008470
polarizability: 3.13373205e+02 -2.50326163e+00 2.25038008e+02 1.18072404e-02 -4.64957178e-03 6.53994760e+01
1716.lowfreq: -0.9877 -0.0017 -0.0017 -0.0005 2.5519 5.1627 23.4261 36.8391 62.5374
frequency: 23.4233 36.8353 62.5373 64.0129 113.7105 119.1439 178.7297 184.4365 189.0727 208.8737 223.3419 249.8131 273.1103 277.7871 325.2184 328.2391 375.3494 420.8065 443.2283 444.5805 451.5363 458.1541 512.5555 520.3397 525.0010 542.7372 572.2842 617.9371 620.6976 649.7788 672.8421 692.6405 693.1220 698.3841 723.9897 762.5382 805.9487 873.7623 921.6519 922.8692 935.7178 966.1599 997.1114 1058.3336 1104.9156 1121.1182 1134.9224 1157.2996 1228.4432 1266.4934 1321.0513 1351.4764 1394.8727 1409.9221 1424.9190 1465.3299 1486.3660 1503.4751 1547.4235 1557.0037 1595.7906 1606.0413 1608.3212 1627.5752 3128.7396 3171.9496 3188.4118 3500.0236 3549.9875 3566.8562 3702.4052 3724.1862
redmass: 10.0809 8.2926 10.3141 6.3194 6.6521 22.2358 6.1330 27.4946 8.5119 6.2646 6.1856 7.8210 8.0459 8.5307 5.5307 3.4888 6.5414 6.9227 3.0063 7.1833 1.1923 1.2123 1.0582 3.6691 1.0902 8.1102 4.1616 1.6922 8.2873 6.7579 3.3351 6.7276 7.1424 3.8862 6.1611 11.4094 1.4373 6.1673 1.4206 5.0048 1.3304 2.6626 5.2960 3.1592 1.9037 3.2960 2.5030 1.4318 1.5267 2.0966 5.9467 4.8127 6.4112 3.8417 4.0672 3.0083 2.5279 6.4621 3.1627 5.1872 1.9832 4.0407 1.8310 1.9348 1.0901 1.0950 1.0927 1.0754 1.0446 1.0444 1.1051 1.1059
irintensity: 0.4341 0.1774 0.1157 0.1462 1.8278 0.8903 0.3965 0.0347 0.7423 10.9615 7.8356 3.9746 0.0006 1.7985 0.6426 6.0661 0.7346 8.6652 0.4265 31.3115 22.3996 469.1847 5.0083 8.1694 100.8698 6.2656 16.9037 41.3299 5.7254 21.1072 7.9160 6.1725 6.9658 0.8012 8.8290 55.2617 60.4723 18.0472 32.3286 23.4117 2.7766 59.5976 24.6026 21.1311 5.0599 46.1818 1.8265 4.8309 0.5570 18.5670 16.8555 2.1428 0.0659 55.3570 93.1567 259.2078 118.5616 649.5895 272.0360 517.2098 320.6288 301.1632 725.3003 212.5852 11.6428 2.3456 47.0246 41.8927 120.1653 105.4731 45.6505 47.3470
temp: 298.150 k
press: 1.00000 atm
elementType: 35 17 17 7 7 7 7 7 6 6 6 6 6 6 6 6 6 6 1 1 1 1 1 1 1 1
symmnumber: 1
zpe: 461660.8 jmol-1
zpe.correction: 0.175837 hartree
zpe.thermalcorrener: 0.192806 hartree
zpe.thermalcorrenthalpy: 0.193750 hartree
zpe.thermalcorrgfe: 0.129028 hartree
zpe.sumelectzpe: -1591.960690 hartree
zpe.sumelectthermal: -1591.943722 hartree
zpe.sumelectthermalent: -1591.942778 hartree
zpe.sumelectthermalfe: -1592.007499 hartree
dipole: -5.0524 -0.4915 -0.0073
dipole: 5.0762
quadrupole: -126.2464 -106.6145 -133.3837
quadrupole: -5.3246 0.0153 -0.0185
quadrupole: -4.1648 15.4671 -11.3022 -5.3246 0.0153 -0.0185
hfenergy: -1592.1365274 hartree
pointgroup: C01 [X(C10H8Br1Cl2N5)]
dipole: 1.8705724 -0.6918881 0.1041229 debye
dipolederiv: -0.1710512 0.0531389 -0.0087886 0.1242922 -0.7322454 -0.0156924 -0.0063984 -0.0199667 -0.0108642 -0.1621369 0.138906 -0.0028218 0.3019807 -0.6688629 -0.0014832 0.0029496 -0.0122981 -0.0475832 -0.9277749 0.1018543 -0.0567463 0.1348032 -0.0821047 0.0075114 -0.056512 0.0055058 -0.0393828 -2.5327656 -0.0355577 -0.1472232 -0.3770347 -0.3242249 -0.0248374 -0.1578337 -0.0013981 -0.3406227 -1.0474606 -0.3378516 -0.0649945 -0.5049118 -1.2008615 -0.065018 -0.0690785 -0.0538692 -0.2382266 -0.9171842 0.3590358 -0.0306498 0.0460327 -1.1538036 -0.0255958 -0.0409965 -0.0048838 -0.2810039 -1.598195 0.3549422 -0.0477063 0.4897897 -0.3362812 0.0446005 -0.0435445 0.035837 -0.7064754 -0.2039241 0.0702928 0.0367278 -0.1780387 -1.6168033 -0.0401538 0.0289501 -0.0211352 -0.7194662 1.8995847 -0.140509 0.1149853 -0.5838208 0.1248311 -0.038221 0.1006398 -0.0088833 0.1191027 2.4431594 -0.0907126 0.141655 0.969041 0.6768789 0.0783323 0.1757118 0.0082635 0.2509973 -0.5519776 0.0926749 -0.0254994 0.377352 -0.2991795 0.0189181 -0.0168579 -0.0001825 -0.1203399 -0.4500309 0.0753453 -0.0127568 -0.1723947 0.0367003 -0.0027403 -0.0214828 0.0138086 -0.21853 -1.6096092 0.0186069 -0.0889578 -0.3884193 0.7973308 0.0088796 -0.1020035 0.0347554 -0.259736 2.1780996 -0.143545 0.123454 -0.0351975 0.6820057 0.0117746 0.126491 0.0050219 0.2584965 0.200203 -0.2309715 0.0073109 -0.3880029 1.0262984 0.0112602 0.0012335 0.0214929 -0.0298457 -0.0546665 -0.0830468 -0.0016378 0.0740675 0.0861575 0.010551 0.0042185 0.0001483 -0.0761317 1.0151747 -0.0692948 0.0721627 -0.1685867 -0.232495 -0.0170528 0.0700568 -0.0104991 -0.0769757 0.9425773 -0.0478643 0.0467701 0.3409963 2.1573737 0.0856452 0.0591355 0.0593016 0.2173073 0.2394904 -0.0563875 -0.0051559 -0.058975 0.1726328 -0.0075515 -0.005401 -0.0075385 0.2864688 0.3327581 -0.0428359 0.0091795 -0.0134552 0.0638568 -0.004521 0.0102027 -0.0064725 0.1680284 0.0373984 0.0974078 -0.0058167 0.0762044 -0.0671732 -0.0030585 -0.0064956 -0.0017165 0.1713524 0.0166324 -0.061886 -0.0119416 -0.0653959 0.0168916 -0.0094211 -0.0121933 -0.0092825 0.1613924 0.3088599 -0.0106162 -0.0051206 0.0164326 0.1549757 -0.0062511 -0.0039648 -0.0080479 0.379727 0.2832714 -0.0270271 -0.0074955 -0.070359 0.1779153 -0.0114305 -0.0088746 -0.0086774 0.3814687 0.1768424 0.0574137 -0.0125339 0.0435367 0.273172 -0.0011575 -0.0133981 -0.0015469 0.3895599 0.1527252 -0.0415125 -0.0163988 0.0100631 0.2670145 -0.0032871 -0.0145543 -0.0077368 0.3812825 unknown
polarizability: 307.9118476|-19.8423108|229.3288212|15.4785753|4.1777041|66.5700207 unknown
InChI: InChI=1S/C10H8BrCl2N5/c11-7-8(14)17-10(15)18-9(7)16-4-1-2-5(12)6(13)3-4/h1-3,16H,14-15H2
charge 0 multiplicity 1
26 atoms
Br 2.667332 -3.01309 -0.039045
Cl -3.524815 2.675974 -0.257495
Cl -5.779499 0.281563 -0.494197
N  0.108419 -1.130915 -0.143718
N  1.210033 0.981658 -0.002547
N  3.650636 1.110547 0.162469
N  4.981614 -0.803386 0.187558
N  2.323364 3.029861 0.137154
C  -1.24467 -0.726526 -0.221785
C  1.276951 -0.383847 -0.043418
C  -1.666868 0.629235 -0.20348
C  -2.224004 -1.755863 -0.323449
C  2.53949 -1.043822 0.017286
C  3.721319 -0.260335 0.121573
C  -3.038435 0.927008 -0.285717
C  -3.590804 -1.437544 -0.404605
C  -4.008884 -0.089856 -0.386325
C  2.400537 1.657411 0.097855
H  0.259601 -2.143283 -0.165826
H  -0.915289 1.41499 -0.125278
H  -1.917549 -2.808698 -0.339233
H  -4.339486 -2.230916 -0.482649
H  5.768263 -0.162459 0.260613
H  5.131317 -1.808418 0.164484
H  3.179969 3.570376 0.21395
H  1.41486 3.48194 0.093424
