program: Gaussian 09
title: 000251737
version: EM64L-G09RevD.01
frameworkgroup: C1[X(C10H9Br2N5)]
method: RPBEPBE
basis: SDD
operation: Freq
keyword: #p
keyword: freq=noraman
keyword: PBEPBE/SDD
title: #p freq=noraman PBEPBE/SDD
converged: YES YES NO NO
title: Mulliken charges:
elementType: Br Br N N N N N C C C C C C C C C C H H H H H H H H H
charge: -0.023750 -0.005166 -0.465563 -0.164590 -0.132608 -0.637686 -0.591834 0.448679 0.426659 -0.541701 -0.446496 -0.311727 0.352107 -0.155824 -0.172165 0.003788 -0.238173 0.304015 0.227760 0.313660 0.248009 0.243261 0.332750 0.329393 0.326229 0.330977
chargesum: 0.00000
title: Mulliken charges with hydrogens summed into heavy atoms:
elementType: Br Br N N N N N C C C C C C C C C C
charge: -0.023750 -0.005166 -0.161549 -0.164590 -0.132608 0.024457 0.065372 0.448679 0.426659 -0.541701 -0.218735 0.001933 0.352107 0.092184 0.071095 0.003788 -0.238173
polarizability: 3.28143988e+02 3.53807614e+00 2.07152682e+02 -7.64422260e-02 -2.28285429e-01 6.35331501e+01
1716.lowfreq: -3.7075 0.0005 0.0006 0.0006 1.7825 3.7702 28.7826 38.4340 60.6919
frequency: 28.7553 38.4217 60.6919 63.6614 114.4554 122.7001 179.3077 206.6644 216.2322 228.8365 258.0696 271.1663 305.7443 318.8636 338.8108 375.0017 411.2125 443.5930 454.3218 504.3164 506.6623 511.5548 523.2773 539.8673 610.6167 622.6205 622.9393 654.2399 675.4388 693.3919 706.1866 723.3153 761.9587 815.1153 820.1922 844.4950 922.2706 941.6993 962.1641 985.5731 988.8931 1055.7285 1061.0020 1101.5558 1127.9242 1136.4001 1183.9999 1261.9693 1289.6945 1316.6915 1352.6709 1398.0005 1412.3060 1424.1281 1472.9632 1486.7405 1505.9187 1548.0338 1563.2152 1599.0409 1605.2284 1609.1932 1627.1796 3116.7069 3159.2787 3171.7536 3197.5035 3498.6301 3549.9938 3569.0381 3702.5067 3726.8965
redmass: 6.0355 4.7000 11.0365 6.0553 7.2043 19.0096 8.3124 5.7205 7.0089 7.9525 9.1500 7.7743 3.6287 5.4325 4.3065 5.8105 3.0078 1.2023 1.1721 2.2195 3.3070 1.1432 1.0873 8.1656 8.0210 6.7853 1.7960 6.6216 2.8732 8.7498 3.3640 6.1670 11.0675 1.4105 5.3965 1.4145 5.3843 1.3587 2.5604 1.3179 5.0311 3.2233 2.4206 1.7186 2.0499 2.4885 1.1097 2.3527 1.4951 4.4349 4.7051 5.2556 3.6283 4.3257 2.7240 2.4150 6.4958 3.1413 4.2406 1.9423 3.9356 1.9698 1.8698 1.0903 1.0913 1.0948 1.0945 1.0753 1.0446 1.0443 1.1051 1.1059
irintensity: 0.0038 0.4309 0.0117 0.0478 0.8390 0.5922 1.0222 14.4552 3.1013 3.2925 3.9151 0.0617 9.3624 0.4619 1.4893 21.8350 0.4715 111.9608 379.0668 34.4028 1.0211 12.0019 95.5087 5.5114 3.6198 1.9347 37.1994 9.8094 9.3568 7.4310 0.0667 6.8053 52.8761 41.1165 17.4443 63.0203 24.6944 1.2223 28.8852 3.1052 43.4992 27.1178 30.4136 8.1102 3.1378 0.9889 6.1514 43.7859 8.3773 22.8921 0.3687 1.4800 89.6621 60.2194 217.0167 198.5398 657.2755 244.4801 595.3999 222.2906 167.7358 832.2149 210.6059 15.5452 4.1178 4.4195 19.8520 36.9065 117.4551 105.5945 45.2806 45.4433
temp: 298.150 k
press: 1.00000 atm
elementType: 35 35 7 7 7 7 7 6 6 6 6 6 6 6 6 6 6 1 1 1 1 1 1 1 1 1
symmnumber: 1
zpe: 485714.9 jmol-1
zpe.correction: 0.184999 hartree
zpe.thermalcorrener: 0.200926 hartree
zpe.thermalcorrenthalpy: 0.201870 hartree
zpe.thermalcorrgfe: 0.139072 hartree
zpe.sumelectzpe: -685.974364 hartree
zpe.sumelectthermal: -685.958437 hartree
zpe.sumelectthermalent: -685.957493 hartree
zpe.sumelectthermalfe: -686.020291 hartree
dipole: 4.1386 0.4666 0.0128
dipole: 4.1649
quadrupole: -111.9020 -95.9678 -124.8947
quadrupole: 1.6144 -0.0387 -0.0337
quadrupole: -0.9805 14.9537 -13.9732 1.6144 -0.0387 -0.0337
hfenergy: -686.1593628 hartree
pointgroup: C01 [X(C10H9Br2N5)]
dipole: 1.6327863 0.1368853 -0.0153017 debye
dipolederiv: -0.1641369 -0.0172965 -0.0004815 -0.092992 -0.7214893 -0.1301048 -0.0149055 -0.1316686 -0.0367053 -0.8676794 -0.1657427 -0.0114014 -0.2129044 -0.1209077 -0.0081369 -0.0199002 -0.0090215 -0.0493887 -2.5756725 -0.0251259 0.0426397 0.2858923 -0.2905912 0.0008608 0.0963575 0.0082441 -0.3281993 -1.1092967 0.3653245 0.0847812 0.5499685 -1.1464688 -0.1799166 0.1171541 -0.1751655 -0.2716486 -0.9118303 -0.3307521 -0.0486403 -0.0169016 -1.1689216 -0.1654497 0.0088707 -0.1587751 -0.3083359 -1.5558862 -0.4056316 -0.0577895 -0.5642279 -0.4017047 0.067565 -0.0875225 0.0644901 -0.6935706 -0.2155755 0.0248122 -0.0043403 0.2731937 -1.607029 -0.1673432 0.0405607 -0.1575788 -0.7563508 1.8274443 0.2018228 -0.0006297 0.6421687 0.0725887 -0.0208425 0.0811141 -0.0118799 0.1069006 2.5440342 0.1268235 -0.0219758 -0.8939292 0.6529094 0.09555 -0.2020121 0.0744649 0.2570104 -1.6615901 -0.1289737 0.0045036 0.2348092 0.7675858 0.1857913 0.0707068 0.1925476 -0.2207291 -0.393977 -0.0565339 -0.0061479 0.1188562 0.0522373 0.042442 0.0246868 0.046761 -0.1970309 -0.3583401 -0.0127438 0.0015084 -0.2721021 -0.0820626 0.0196217 -0.0446019 0.0148811 -0.1586167 2.1899557 0.2022533 -0.0012691 0.1136781 0.6985091 0.0815281 -0.015269 0.0794822 0.2639981 -0.2101038 -0.0977102 -0.0145325 -0.1081404 0.0462788 0.0251577 -0.0160336 0.0248037 -0.0794913 -0.2357087 -0.0416457 -0.0039077 -0.0430077 0.0838414 0.0308096 -0.0050738 0.0308414 -0.0810109 0.9936358 -0.0382657 -0.0225316 -0.4194444 2.115107 0.3612931 -0.0927045 0.3515112 0.2759305 1.2167505 0.3230408 0.0269957 0.3634076 0.0170118 0.0214672 0.03479 0.0222739 -0.1460628 0.2326731 0.0596829 0.0125667 0.0506807 0.1749439 -0.0207222 0.0084043 -0.0214373 0.2813468 0.0259377 -0.097919 -0.0141325 -0.0780394 -0.07542 -0.0409924 -0.0108332 -0.0409626 0.1615069 0.2386219 0.0514961 0.0072793 0.0427188 0.0529943 -0.020675 0.0050189 -0.0213118 0.1617894 0.0037302 0.0778549 0.016998 0.0857549 0.0300247 -0.024765 0.0184011 -0.0247155 0.1560277 0.0773332 -0.0344093 -0.0042598 -0.0612821 -0.0446545 -0.0336109 -0.0087793 -0.0343713 0.1487422 0.3062448 0.0178991 0.0045039 -0.0048835 0.1634744 -0.0399388 -0.0001754 -0.0404763 0.3726535 0.2756076 0.030003 0.0074019 0.0745681 0.1881529 -0.0376774 0.0154962 -0.0368059 0.375793 0.1463341 0.0314867 0.0097676 -0.0189759 0.2740498 -0.0200064 0.0002784 -0.0227753 0.3786338 0.1814943 -0.0597497 -0.0069066 -0.0488664 0.2695401 -0.0219048 -0.0040286 -0.0233559 0.3868082 unknown
polarizability: 324.917941|20.1346285|205.68174|-1.8360839|25.522304|68.2301385 unknown
InChI: InChI=1S/C10H9Br2N5/c11-5-1-3-6(4-2-5)15-9-7(12)8(13)16-10(14)17-9/h1-4,15H,13-14H2
charge 0 multiplicity 1
26 atoms
Br 2.301263 2.979357 0.558685
Br -6.093297 -0.772678 0.050156
N  -0.137843 0.971472 0.227704
N  1.094849 -1.036051 -0.164749
N  3.545175 -1.00575 -0.205551
N  4.75517 0.958211 0.135452
N  2.341068 -2.974433 -0.545853
C  -1.472718 0.498693 0.172092
C  1.074169 0.309636 0.084769
C  2.297113 1.037542 0.197146
C  -2.499401 1.466658 0.364281
C  -1.837116 -0.855743 -0.057747
C  3.528412 0.344909 0.045141
C  -3.858345 1.099648 0.329813
C  -3.199193 -1.224074 -0.092155
C  2.32901 -1.620941 -0.296111
C  -4.197997 -0.249738 0.10081
H  -0.044399 1.975133 0.407511
H  -2.237113 2.517274 0.542892
H  -1.0482 -1.593351 -0.204941
H  -4.635604 1.85423 0.47911
H  -3.47272 -2.268521 -0.269302
H  5.582286 0.378786 0.013103
H  4.841434 1.954215 0.318729
H  1.461857 -3.475944 -0.626352
H  3.233038 -3.448337 -0.652935
